NoPaste

transcode

von KBDCALLS
Beschreibung:
Fehler beim Kompilieren
Snippet erstellt:
04.03.2019 09:38:33
Snippet wird automatisch gelöscht:
Niemals

Dein Code:
  1. dpkg-checkbuilddeps: error: Unmet build dependencies: liba52-0.7.4-dev libdv4-dev libdvdread-dev libfaad-dev liblzo2-dev libmjpegtools-dev libmp3lame-dev libmpeg2-4-dev libpopt-dev libpostproc-dev libquicktime-dev libsdl1.2-dev libtheora-dev libvorbis-dev libxaw7-dev libxv-dev
  2. W: Unmet build-dependency in source
  3. dh clean --parallel --with autoreconf
  4.    dh_clean
  5. dpkg-source: info: using source format '3.0 (quilt)'
  6. dpkg-source: info: building transcode using existing ./transcode_1.1.7.orig.tar.bz2
  7. dpkg-source: info: using patch list from debian/patches/series
  8. dpkg-source: info: building transcode in transcode_1.1.7-9.1.debian.tar.xz
  9. dpkg-source: info: building transcode in transcode_1.1.7-9.1.dsc
  10. I: Generating source changes file for original dsc
  11. dpkg-genchanges: info: not including original source code in upload
  12. W: cgroups are not available on the host, not using them.
  13. I: pbuilder: network access will be disabled during build
  14. I: Current time: Mon Mar  4 09:04:46 CET 2019
  15. I: pbuilder-time-stamp: 1551686686
  16. I: Building the build Environment
  17. I: extracting base tarball [/var/cache/pbuilder/base.sid.amd64.tgz]
  18. I: copying local configuration
  19. I: mounting /proc filesystem
  20. I: mounting /sys filesystem
  21. I: creating /{dev,run}/shm
  22. I: mounting /dev/pts filesystem
  23. I: redirecting /dev/ptmx to /dev/pts/ptmx
  24. I: Mounting /var/packages
  25. I: policy-rc.d already exists
  26. I: Obtaining the cached apt archive contents
  27. I: Copying source file
  28. I: copying [../transcode_1.1.7-9.1.dsc]
  29. I: copying [../transcode_1.1.7.orig.tar.bz2]
  30. I: copying [../transcode_1.1.7-9.1.debian.tar.xz]
  31. I: Extracting source
  32. dpkg-source: warning: extracting unsigned source package (transcode_1.1.7-9.1.dsc)
  33. dpkg-source: info: extracting transcode in transcode-1.1.7
  34. dpkg-source: info: unpacking transcode_1.1.7.orig.tar.bz2
  35. dpkg-source: info: unpacking transcode_1.1.7-9.1.debian.tar.xz
  36. dpkg-source: info: using patch list from debian/patches/series
  37. dpkg-source: info: applying 01_filter_pv.c.diff
  38. dpkg-source: info: applying 03_libav-api-fixes.diff
  39. dpkg-source: info: applying 04_ffmpeg_options.patch
  40. dpkg-source: info: applying ac3-audio-track-number.patch
  41. dpkg-source: info: applying 05-libav9-gentoo.patch
  42. dpkg-source: info: applying 06_libav9-jmm.patch
  43. dpkg-source: info: applying 07_libav9-preset.patch
  44. dpkg-source: info: applying 08_libav9-opt.patch
  45. dpkg-source: info: applying 09_libav9-arch.patch
  46. dpkg-source: info: applying 10_freetype.patch
  47. dpkg-source: info: applying 11_libav10.patch
  48. dpkg-source: info: applying 12_underlinkage.patch
  49. I: using fakeroot in build.
  50. I: Installing the build-deps
  51.  -> Attempting to satisfy build-dependencies
  52.  -> Creating pbuilder-satisfydepends-dummy package
  53. Package: pbuilder-satisfydepends-dummy
  54. Version: 0.invalid.0
  55. Architecture: amd64
  56. Maintainer: Debian Pbuilder Team <pbuilder-maint@lists.alioth.debian.org>
  57. Description: Dummy package to satisfy dependencies with aptitude - created by pbuilder
  58.  This package was created automatically by pbuilder to satisfy the
  59.  build-dependencies of the package being currently built.
  60. Depends: debhelper (>= 9), dh-autoreconf, liba52-0.7.4-dev, libasound2-dev, libavcodec-dev (>= 6:9), libavformat-dev (>= 6:9), libavutil-dev (>= 6:9), libavresample-dev (>= 6.9), libdv4-dev, libdvdread-dev, libfaad-dev, libfreetype6-dev, libjpeg-dev, liblzo2-dev, libmagickcore-dev, libmagickwand-dev, libmjpegtools-dev, libmp3lame-dev, libmpeg2-4-dev, libpopt-dev, libpostproc-dev, libquicktime-dev, libsdl1.2-dev, libswscale-dev, libtheora-dev, libvorbis-dev, libxaw7-dev, libxft-dev, libxml2-dev, libxv-dev
  61. dpkg-deb: building package 'pbuilder-satisfydepends-dummy' in '/tmp/satisfydepends-aptitude/pbuilder-satisfydepends-dummy.deb'//ftp.nl.debian.org/debian sid/main amd64 imagemagick-6-common all 8:6.9.10.23+dfsg-2 [200 kB]
  62. Get: 2 http://ftp.nl.debian.org/debian sid/main amd64 libmagickcore-6-headers all 8:6.9.10.23+dfsg-2 [49.3 kB]
  63. Get: 3 http://ftp.nl.debian.org/debian sid/main amd64 libmagickcore-6-arch-config amd64 8:6.9.10.23+dfsg-2 [163 kB]
  64. Get: 4 http://ftp.nl.debian.org/debian sid/main amd64 libfftw3-double3 amd64 3.3.8-2 [733 kB]
  65. Get: 5 http://ftp.nl.debian.org/debian sid/main amd64 libx265-165 amd64 2.9-4 [1041 kB]
  66. Get: 6 http://ftp.nl.debian.org/debian sid/main amd64 liblqr-1-0 amd64 0.4.2-2.1 [29.1 kB]
  67. Get: 7 http://ftp.nl.debian.org/debian sid/main amd64 libmagickcore-6.q16-6 amd64 8:6.9.10.23+dfsg-2 [1779 kB]
  68. Get: 8 http://ftp.nl.debian.org/debian sid/main amd64 libdjvulibre-text all 3.5.27.1-10 [61.0 kB]
  69. Get: 9 http://ftp.nl.debian.org/debian sid/main amd64 libdjvulibre21 amd64 3.5.27.1-10 [589 kB]
  70. Get: 10 http://ftp.nl.debian.org/debian sid/main amd64 libmagickwand-6.q16-6 amd64 8:6.9.10.23+dfsg-2 [447 kB]
  71. Get: 11 http://ftp.nl.debian.org/debian sid/main amd64 libwmf0.2-7 amd64 0.2.8.4-14 [166 kB]
  72. Get: 12 http://ftp.nl.debian.org/debian sid/main amd64 libmagickcore-6.q16-6-extra amd64 8:6.9.10.23+dfsg-2 [205 kB]
  73. Get: 13 http://ftp.nl.debian.org/debian sid/main amd64 libdjvulibre-dev amd64 3.5.27.1-10 [2419 kB]
  74. Get: 14 http://ftp.nl.debian.org/debian sid/main amd64 libexif12 amd64 0.6.21-5.1 [325 kB]
  75. Get: 15 http://ftp.nl.debian.org/debian sid/main amd64 libexif-dev amd64 0.6.21-5.1 [112 kB]
  76. Get: 16 http://ftp.nl.debian.org/debian sid/main amd64 libpng-dev amd64 1.6.36-5 [300 kB]
  77. Get: 17 http://ftp.nl.debian.org/debian sid/main amd64 libopenjp2-7-dev amd64 2.3.0-1.1 [43.8 kB]
  78. Get: 18 http://ftp.nl.debian.org/debian sid/main amd64 liblqr-1-0-dev amd64 0.4.2-2.1 [72.2 kB]
  79. Get: 19 http://ftp.nl.debian.org/debian sid/main amd64 libltdl-dev amd64 2.4.6-10 [162 kB]
  80. Get: 20 http://ftp.nl.debian.org/debian sid/main amd64 libgirepository-1.0-1 amd64 1.58.3-2 [92.8 kB]
  81. Get: 21 http://ftp.nl.debian.org/debian sid/main amd64 gir1.2-glib-2.0 amd64 1.58.3-2 [143 kB]
  82. Get: 22 http://ftp.nl.debian.org/debian sid/main amd64 libcairo-gobject2 amd64 1.16.0-3 [124 kB]
  83. Get: 23 http://ftp.nl.debian.org/debian sid/main amd64 gir1.2-freedesktop amd64 1.58.3-2 [20.3 kB]
  84. Get: 24 http://ftp.nl.debian.org/debian sid/main amd64 gir1.2-rsvg-2.0 amd64 2.44.10-1 [21.6 kB]
  85. Get: 25 http://ftp.nl.debian.org/debian sid/main amd64 libcairo-script-interpreter2 amd64 1.16.0-3 [160 kB]
  86. Get: 26 http://ftp.nl.debian.org/debian sid/main amd64 libpthread-stubs0-dev amd64 0.4-1 [5344 B]
  87. Get: 27 http://ftp.nl.debian.org/debian sid/main amd64 libsm-dev amd64 2:1.2.3-1 [38.0 kB]
  88. Get: 28 http://ftp.nl.debian.org/debian sid/main amd64 libcairo2-dev amd64 1.16.0-3 [734 kB]
  89. Get: 29 http://ftp.nl.debian.org/debian sid/main amd64 librsvg2-dev amd64 2.44.10-1 [41.7 kB]
  90. Get: 30 http://ftp.nl.debian.org/debian sid/main amd64 liblzma-dev amd64 5.2.4-1 [210 kB]
  91. Get: 31 http://ftp.nl.debian.org/debian sid/main amd64 libtiffxx5 amd64 4.0.10-4 [108 kB]
  92. Get: 32 http://ftp.nl.debian.org/debian sid/main amd64 libtiff-dev amd64 4.0.10-4 [378 kB]
  93. Get: 33 http://ftp.nl.debian.org/debian sid/main amd64 libwmf-dev amd64 0.2.8.4-14 [190 kB]
  94. Get: 34 http://ftp.nl.debian.org/debian sid/main amd64 libmagickcore-6.q16-dev amd64 8:6.9.10.23+dfsg-2 [1110 kB]
  95. Get: 35 http://ftp.nl.debian.org/debian sid/main amd64 libmagickcore-dev all 8:6.9.10.23+dfsg-2 [1332 B]
  96. Get: 36 http://ftp.nl.debian.org/debian sid/main amd64 libmagickwand-6-headers all 8:6.9.10.23+dfsg-2 [10.5 kB]
  97. Get: 37 http://ftp.nl.debian.org/debian sid/main amd64 libmagickwand-6.q16-dev amd64 8:6.9.10.23+dfsg-2 [444 kB]
  98. Get: 38 http://ftp.nl.debian.org/debian sid/main amd64 libmagickwand-dev all 8:6.9.10.23+dfsg-2 [1320 B]
  99. Get: 39 http://ftp.nl.debian.org/debian sid/main amd64 liba52-0.7.4 amd64 0.7.4-19 [38.1 kB]
  100. Get: 40 http://ftp.nl.debian.org/debian sid/main amd64 liba52-0.7.4-dev amd64 0.7.4-19 [53.7 kB]
  101. Get: 41 http://ftp.nl.debian.org/debian sid/main amd64 libasound2-data all 1.1.8-1 [59.6 kB]
  102. Get: 42 http://ftp.nl.debian.org/debian sid/main amd64 libasound2 amd64 1.1.8-1 [361 kB]
  103. Get: 43 http://ftp.nl.debian.org/debian sid/main amd64 libasound2-dev amd64 1.1.8-1 [145 kB]
  104. Get: 44 http://ftp.nl.debian.org/debian sid/main amd64 libdrm-common all 2.4.97-1 [13.8 kB]
  105. Get: 45 http://ftp.nl.debian.org/debian sid/main amd64 libdrm2 amd64 2.4.97-1 [39.7 kB]
  106. Get: 46 http://ftp.nl.debian.org/debian sid/main amd64 libva2 amd64 2.4.0-1 [57.2 kB]
  107. Get: 47 http://ftp.nl.debian.org/debian sid/main amd64 libva-drm2 amd64 2.4.0-1 [16.6 kB]
  108. Get: 48 http://ftp.nl.debian.org/debian sid/main amd64 libva-x11-2 amd64 2.4.0-1 [21.3 kB]
  109. Get: 49 http://ftp.nl.debian.org/debian sid/main amd64 libvdpau1 amd64 1.1.1-10 [42.0 kB]
  110. Get: 50 http://ftp.nl.debian.org/debian sid/main amd64 libavutil56 amd64 7:4.1.1-1 [225 kB]
  111. Get: 51 http://ftp.nl.debian.org/debian sid/main amd64 libgsm1 amd64 1.0.18-1 [27.6 kB]
  112. Get: 52 http://ftp.nl.debian.org/debian sid/main amd64 libswresample3 amd64 7:4.1.1-1 [92.5 kB]
  113. Get: 53 http://ftp.nl.debian.org/debian sid/main amd64 libtheora0 amd64 1.1.1+dfsg.1-15 [169 kB]
  114. Get: 54 http://ftp.nl.debian.org/debian sid/main amd64 libvorbis0a amd64 1.3.6-2 [93.5 kB]
  115. Get: 55 http://ftp.nl.debian.org/debian sid/main amd64 libvorbisenc2 amd64 1.3.6-2 [80.2 kB]
  116. Get: 56 http://ftp.nl.debian.org/debian sid/main amd64 libzvbi-common all 0.2.35-16 [64.3 kB]
  117. Get: 57 http://ftp.nl.debian.org/debian sid/main amd64 libzvbi0 amd64 0.2.35-16 [270 kB]
  118. Get: 58 http://ftp.nl.debian.org/debian sid/main amd64 libavcodec58 amd64 7:4.1.1-1 [4784 kB]
  119. Get: 59 http://ftp.nl.debian.org/debian sid/main amd64 libavutil-dev amd64 7:4.1.1-1 [342 kB]
  120. Get: 60 http://ftp.nl.debian.org/debian sid/main amd64 libswresample-dev amd64 7:4.1.1-1 [106 kB]
  121. Get: 61 http://ftp.nl.debian.org/debian sid/main amd64 libavcodec-dev amd64 7:4.1.1-1 [5310 kB]
  122. Get: 62 http://ftp.nl.debian.org/debian sid/main amd64 libbluray2 amd64 1:1.1.0-1 [145 kB]
  123. Get: 63 http://ftp.nl.debian.org/debian sid/main amd64 libchromaprint1 amd64 1.4.3-3 [41.4 kB]
  124. Get: 64 http://ftp.nl.debian.org/debian sid/main amd64 libvorbisfile3 amd64 1.3.6-2 [25.5 kB]
  125. Get: 65 http://ftp.nl.debian.org/debian sid/main amd64 libopenmpt0 amd64 0.4.3-1 [626 kB]
  126. Get: 66 http://ftp.nl.debian.org/debian sid/main amd64 libkeyutils1 amd64 1.6-5 [14.9 kB]
  127. Get: 67 http://ftp.nl.debian.org/debian sid/main amd64 libavformat58 amd64 7:4.1.1-1 [996 kB]
  128. Get: 68 http://ftp.nl.debian.org/debian sid/main amd64 libavformat-dev amd64 7:4.1.1-1 [1194 kB]
  129. Get: 69 http://ftp.nl.debian.org/debian sid/main amd64 libavresample4 amd64 7:4.1.1-1 [89.6 kB]
  130. Get: 70 http://ftp.nl.debian.org/debian sid/main amd64 libavresample-dev amd64 7:4.1.1-1 [99.2 kB]
  131. Get: 71 http://ftp.nl.debian.org/debian sid/main amd64 libslang2 amd64 2.3.2-2 [507 kB]
  132. Get: 72 http://ftp.nl.debian.org/debian sid/main amd64 libslang2-dev amd64 2.3.2-2 [483 kB]
  133. Get: 73 http://ftp.nl.debian.org/debian sid/main amd64 libcaca-dev amd64 0.99.beta19-2+b3 [897 kB]
  134. Get: 74 http://ftp.nl.debian.org/debian sid/main amd64 libdrm-amdgpu1 amd64 2.4.97-1 [27.3 kB]
  135. Get: 75 http://ftp.nl.debian.org/debian sid/main amd64 libdrm-intel1 amd64 2.4.97-1 [69.8 kB]
  136. Get: 76 http://ftp.nl.debian.org/debian sid/main amd64 libdrm-radeon1 amd64 2.4.97-1 [31.1 kB]
  137. Get: 77 http://ftp.nl.debian.org/debian sid/main amd64 libdrm-nouveau2 amd64 2.4.97-1 [26.3 kB]
  138. Get: 78 http://ftp.nl.debian.org/debian sid/main amd64 libdrm-dev amd64 2.4.97-1 [131 kB]
  139. Get: 79 http://ftp.nl.debian.org/debian sid/main amd64 libdv4 amd64 1.0.0-12 [74.2 kB]
  140. Get: 80 http://ftp.nl.debian.org/debian sid/main amd64 libpopt0 amd64 1.16-12 [49.4 kB]
  141. Get: 81 http://ftp.nl.debian.org/debian sid/main amd64 libpopt-dev amd64 1.16-12 [51.0 kB]
  142. Get: 82 http://ftp.nl.debian.org/debian sid/main amd64 libdv4-dev amd64 1.0.0-12 [26.5 kB]
  143. Get: 83 http://ftp.nl.debian.org/debian sid/main amd64 libdvdread4 amd64 6.0.1-1 [85.3 kB]
  144. Get: 84 http://ftp.nl.debian.org/debian sid/main amd64 libdvdread-dev amd64 6.0.1-1 [99.4 kB]
  145. Get: 85 http://ftp.nl.debian.org/debian sid/main amd64 libgbm1 amd64 18.3.4-2 [67.5 kB]
  146. Get: 86 http://ftp.nl.debian.org/debian sid/main amd64 libglapi-mesa amd64 18.3.4-2 [65.7 kB]
  147. Get: 87 http://ftp.nl.debian.org/debian sid/main amd64 libegl-mesa0 amd64 18.3.4-2 [135 kB]
  148. Get: 88 http://ftp.nl.debian.org/debian sid/main amd64 libfaad2 amd64 2.8.8-1 [158 kB]
  149. Get: 89 http://ftp.nl.debian.org/debian sid/main amd64 libfaad-dev amd64 2.8.8-1 [174 kB]
  150. Get: 90 http://ftp.nl.debian.org/debian sid/main amd64 mesa-common-dev amd64 18.3.4-2 [609 kB]
  151. Get: 91 http://ftp.nl.debian.org/debian sid/main amd64 libllvm7 amd64 1:7.0.1-8 [13.0 MB]
  152. Get: 92 http://ftp.nl.debian.org/debian sid/main amd64 libsensors-config all 1:3.5.0-3 [31.6 kB]
  153. Get: 93 http://ftp.nl.debian.org/debian sid/main amd64 libsensors5 amd64 1:3.5.0-3 [52.6 kB]
  154. Get: 94 http://ftp.nl.debian.org/debian sid/main amd64 libgl1-mesa-dri amd64 18.3.4-2 [6681 kB]
  155. Get: 95 http://ftp.nl.debian.org/debian sid/main amd64 libglx-mesa0 amd64 18.3.4-2 [180 kB]
  156. Get: 96 http://ftp.nl.debian.org/debian sid/main amd64 libgl1-mesa-dev amd64 18.3.4-2 [47.7 kB]
  157. Get: 97 http://ftp.nl.debian.org/debian sid/main amd64 libmjpegutils-2.1-0 amd64 1:2.1.0+debian-5 [27.8 kB]
  158. Get: 98 http://ftp.nl.debian.org/debian sid/main amd64 libswscale5 amd64 7:4.1.1-1 [190 kB]
  159. Get: 99 http://ftp.nl.debian.org/debian sid/main amd64 libquicktime2 amd64 2:1.2.4-12+b2 [259 kB]
  160. Get: 100 http://ftp.nl.debian.org/debian sid/main amd64 liblavfile-2.1-0 amd64 1:2.1.0+debian-5 [40.4 kB]
  161. Get: 101 http://ftp.nl.debian.org/debian sid/main amd64 liblavjpeg-2.1-0 amd64 1:2.1.0+debian-5 [16.0 kB]
  162. Get: 102 http://ftp.nl.debian.org/debian sid/main amd64 libsndfile1 amd64 1.0.28-5 [252 kB]
  163. Get: 103 http://ftp.nl.debian.org/debian sid/main amd64 libwrap0 amd64 7.6.q-28 [58.7 kB]
  164. Get: 104 http://ftp.nl.debian.org/debian sid/main amd64 libpulse0 amd64 12.2-4 [281 kB]
  165. Get: 105 http://ftp.nl.debian.org/debian sid/main amd64 liblavplay-2.1-0 amd64 1:2.1.0+debian-5 [25.4 kB]
  166. Get: 106 http://ftp.nl.debian.org/debian sid/main amd64 liblzo2-dev amd64 2.10-0.1 [116 kB]
  167. Get: 107 http://ftp.nl.debian.org/debian sid/main amd64 libmpeg2encpp-2.1-0 amd64 1:2.1.0+debian-5 [74.2 kB]
  168. Get: 108 http://ftp.nl.debian.org/debian sid/main amd64 libmplex2-2.1-0 amd64 1:2.1.0+debian-5 [49.6 kB]
  169. Get: 109 http://ftp.nl.debian.org/debian sid/main amd64 libmjpegtools-dev amd64 1:2.1.0+debian-5 [239 kB]
  170. Get: 110 http://ftp.nl.debian.org/debian sid/main amd64 libmp3lame-dev amd64 3.100-2+b1 [389 kB]
  171. Get: 111 http://ftp.nl.debian.org/debian sid/main amd64 libmpeg2-4 amd64 0.5.1-8 [62.1 kB]
  172. Get: 112 http://ftp.nl.debian.org/debian sid/main amd64 libmpeg2-4-dev amd64 0.5.1-8 [76.3 kB]
  173. Get: 113 http://ftp.nl.debian.org/debian sid/main amd64 libogg-dev amd64 1.3.2-1+b1 [200 kB]
  174. Get: 114 http://ftp.nl.debian.org/debian sid/main amd64 libpostproc55 amd64 7:4.1.1-1 [88.6 kB]
  175. Get: 115 http://ftp.nl.debian.org/debian sid/main amd64 libpostproc-dev amd64 7:4.1.1-1 [89.1 kB]
  176. Get: 116 http://ftp.nl.debian.org/debian sid/main amd64 libpulse-mainloop-glib0 amd64 12.2-4 [37.1 kB]
  177. Get: 117 http://ftp.nl.debian.org/debian sid/main amd64 libpulse-dev amd64 12.2-4 [97.3 kB]
  178. Get: 118 http://ftp.nl.debian.org/debian sid/main amd64 libquicktime-dev amd64 2:1.2.4-12+b2 [39.8 kB]
  179. Get: 119 http://ftp.nl.debian.org/debian sid/main amd64 libsdl1.2-dev amd64 1.2.15+dfsg2-4 [728 kB]
  180. Get: 120 http://ftp.nl.debian.org/debian sid/main amd64 libswscale-dev amd64 7:4.1.1-1 [209 kB]
  181. Get: 121 http://ftp.nl.debian.org/debian sid/main amd64 libtheora-dev amd64 1.1.1+dfsg.1-15 [186 kB]
  182. Get: 122 http://ftp.nl.debian.org/debian sid/main amd64 libvorbis-dev amd64 1.3.6-2 [328 kB]
  183. Get: 123 http://ftp.nl.debian.org/debian sid/main amd64 libxaw7-dev amd64 2:1.0.13-1+b2 [261 kB]
  184. Get: 124 http://ftp.nl.debian.org/debian sid/main amd64 libxv-dev amd64 2:1.0.11-1 [48.1 kB]
  185. 'imagemagick-6-common_8%3a6.9.10.23+dfsg-2_all.deb' added
  186. I: new cache content 'libmagickcore-6-headers_8%3a6.9.10.23+dfsg-2_all.deb' added
  187. I: new cache content 'libmagickcore-6-arch-config_8%3a6.9.10.23+dfsg-2_amd64.deb' added
  188. I: new cache content 'libfftw3-double3_3.3.8-2_amd64.deb' added
  189. I: new cache content 'libx265-165_2.9-4_amd64.deb' added
  190. I: new cache content 'liblqr-1-0_0.4.2-2.1_amd64.deb' added
  191. I: new cache content 'libmagickcore-6.q16-6_8%3a6.9.10.23+dfsg-2_amd64.deb' added
  192. I: new cache content 'libdjvulibre-text_3.5.27.1-10_all.deb' added
  193. I: new cache content 'libdjvulibre21_3.5.27.1-10_amd64.deb' added
  194. I: new cache content 'libmagickwand-6.q16-6_8%3a6.9.10.23+dfsg-2_amd64.deb' added
  195. I: new cache content 'libwmf0.2-7_0.2.8.4-14_amd64.deb' added
  196. I: new cache content 'libmagickcore-6.q16-6-extra_8%3a6.9.10.23+dfsg-2_amd64.deb' added
  197. I: new cache content 'libdjvulibre-dev_3.5.27.1-10_amd64.deb' added
  198. I: new cache content 'libexif12_0.6.21-5.1_amd64.deb' added
  199. I: new cache content 'libexif-dev_0.6.21-5.1_amd64.deb' added
  200. I: new cache content 'libpng-dev_1.6.36-5_amd64.deb' added
  201. I: new cache content 'libopenjp2-7-dev_2.3.0-1.1_amd64.deb' added
  202. I: new cache content 'liblqr-1-0-dev_0.4.2-2.1_amd64.deb' added
  203. I: new cache content 'libltdl-dev_2.4.6-10_amd64.deb' added
  204. I: new cache content 'libgirepository-1.0-1_1.58.3-2_amd64.deb' added
  205. I: new cache content 'gir1.2-glib-2.0_1.58.3-2_amd64.deb' added
  206. I: new cache content 'libcairo-gobject2_1.16.0-3_amd64.deb' added
  207. I: new cache content 'gir1.2-freedesktop_1.58.3-2_amd64.deb' added
  208. I: new cache content 'gir1.2-rsvg-2.0_2.44.10-1_amd64.deb' added
  209. I: new cache content 'libcairo-script-interpreter2_1.16.0-3_amd64.deb' added
  210. I: new cache content 'libpthread-stubs0-dev_0.4-1_amd64.deb' added
  211. I: new cache content 'libsm-dev_2%3a1.2.3-1_amd64.deb' added
  212. I: new cache content 'libcairo2-dev_1.16.0-3_amd64.deb' added
  213. I: new cache content 'librsvg2-dev_2.44.10-1_amd64.deb' added
  214. I: new cache content 'liblzma-dev_5.2.4-1_amd64.deb' added
  215. I: new cache content 'libtiffxx5_4.0.10-4_amd64.deb' added
  216. I: new cache content 'libtiff-dev_4.0.10-4_amd64.deb' added
  217. I: new cache content 'libwmf-dev_0.2.8.4-14_amd64.deb' added
  218. I: new cache content 'libmagickcore-6.q16-dev_8%3a6.9.10.23+dfsg-2_amd64.deb' added
  219. I: new cache content 'libmagickcore-dev_8%3a6.9.10.23+dfsg-2_all.deb' added
  220. I: new cache content 'libmagickwand-6-headers_8%3a6.9.10.23+dfsg-2_all.deb' added
  221. I: new cache content 'libmagickwand-6.q16-dev_8%3a6.9.10.23+dfsg-2_amd64.deb' added
  222. I: new cache content 'libmagickwand-dev_8%3a6.9.10.23+dfsg-2_all.deb' added
  223. I: new cache content 'liba52-0.7.4_0.7.4-19_amd64.deb' added
  224. I: new cache content 'liba52-0.7.4-dev_0.7.4-19_amd64.deb' added
  225. I: new cache content 'libasound2-data_1.1.8-1_all.deb' added
  226. I: new cache content 'libasound2_1.1.8-1_amd64.deb' added
  227. I: new cache content 'libasound2-dev_1.1.8-1_amd64.deb' added
  228. I: new cache content 'libdrm-common_2.4.97-1_all.deb' added
  229. I: new cache content 'libdrm2_2.4.97-1_amd64.deb' added
  230. I: new cache content 'libva2_2.4.0-1_amd64.deb' added
  231. I: new cache content 'libva-drm2_2.4.0-1_amd64.deb' added
  232. I: new cache content 'libva-x11-2_2.4.0-1_amd64.deb' added
  233. I: new cache content 'libvdpau1_1.1.1-10_amd64.deb' added
  234. I: new cache content 'libavutil56_7%3a4.1.1-1_amd64.deb' added
  235. I: new cache content 'libgsm1_1.0.18-1_amd64.deb' added
  236. I: new cache content 'libswresample3_7%3a4.1.1-1_amd64.deb' added
  237. I: new cache content 'libtheora0_1.1.1+dfsg.1-15_amd64.deb' added
  238. I: new cache content 'libvorbis0a_1.3.6-2_amd64.deb' added
  239. I: new cache content 'libvorbisenc2_1.3.6-2_amd64.deb' added
  240. I: new cache content 'libzvbi-common_0.2.35-16_all.deb' added
  241. I: new cache content 'libzvbi0_0.2.35-16_amd64.deb' added
  242. I: new cache content 'libavcodec58_7%3a4.1.1-1_amd64.deb' added
  243. I: new cache content 'libavutil-dev_7%3a4.1.1-1_amd64.deb' added
  244. I: new cache content 'libswresample-dev_7%3a4.1.1-1_amd64.deb' added
  245. I: new cache content 'libavcodec-dev_7%3a4.1.1-1_amd64.deb' added
  246. I: new cache content 'libbluray2_1%3a1.1.0-1_amd64.deb' added
  247. I: new cache content 'libchromaprint1_1.4.3-3_amd64.deb' added
  248. I: new cache content 'libvorbisfile3_1.3.6-2_amd64.deb' added
  249. I: new cache content 'libopenmpt0_0.4.3-1_amd64.deb' added
  250. I: new cache content 'libkeyutils1_1.6-5_amd64.deb' added
  251. I: new cache content 'libavformat58_7%3a4.1.1-1_amd64.deb' added
  252. I: new cache content 'libavformat-dev_7%3a4.1.1-1_amd64.deb' added
  253. I: new cache content 'libavresample4_7%3a4.1.1-1_amd64.deb' added
  254. I: new cache content 'libavresample-dev_7%3a4.1.1-1_amd64.deb' added
  255. I: new cache content 'libslang2_2.3.2-2_amd64.deb' added
  256. I: new cache content 'libslang2-dev_2.3.2-2_amd64.deb' added
  257. I: new cache content 'libcaca-dev_0.99.beta19-2+b3_amd64.deb' added
  258. I: new cache content 'libdrm-amdgpu1_2.4.97-1_amd64.deb' added
  259. I: new cache content 'libdrm-intel1_2.4.97-1_amd64.deb' added
  260. I: new cache content 'libdrm-radeon1_2.4.97-1_amd64.deb' added
  261. I: new cache content 'libdrm-nouveau2_2.4.97-1_amd64.deb' added
  262. I: new cache content 'libdrm-dev_2.4.97-1_amd64.deb' added
  263. I: new cache content 'libdv4_1.0.0-12_amd64.deb' added
  264. I: new cache content 'libpopt0_1.16-12_amd64.deb' added
  265. I: new cache content 'libpopt-dev_1.16-12_amd64.deb' added
  266. I: new cache content 'libdv4-dev_1.0.0-12_amd64.deb' added
  267. I: new cache content 'libdvdread4_6.0.1-1_amd64.deb' added
  268. I: new cache content 'libdvdread-dev_6.0.1-1_amd64.deb' added
  269. I: new cache content 'libgbm1_18.3.4-2_amd64.deb' added
  270. I: new cache content 'libglapi-mesa_18.3.4-2_amd64.deb' added
  271. I: new cache content 'libegl-mesa0_18.3.4-2_amd64.deb' added
  272. I: new cache content 'libfaad2_2.8.8-1_amd64.deb' added
  273. I: new cache content 'libfaad-dev_2.8.8-1_amd64.deb' added
  274. I: new cache content 'mesa-common-dev_18.3.4-2_amd64.deb' added
  275. I: new cache content 'libllvm7_1%3a7.0.1-8_amd64.deb' added
  276. I: new cache content 'libsensors-config_1%3a3.5.0-3_all.deb' added
  277. I: new cache content 'libsensors5_1%3a3.5.0-3_amd64.deb' added
  278. I: new cache content 'libgl1-mesa-dri_18.3.4-2_amd64.deb' added
  279. I: new cache content 'libglx-mesa0_18.3.4-2_amd64.deb' added
  280. I: new cache content 'libgl1-mesa-dev_18.3.4-2_amd64.deb' added
  281. I: new cache content 'libmjpegutils-2.1-0_1%3a2.1.0+debian-5_amd64.deb' added
  282. I: new cache content 'libswscale5_7%3a4.1.1-1_amd64.deb' added
  283. I: new cache content 'libquicktime2_2%3a1.2.4-12+b2_amd64.deb' added
  284. I: new cache content 'liblavfile-2.1-0_1%3a2.1.0+debian-5_amd64.deb' added
  285. I: new cache content 'liblavjpeg-2.1-0_1%3a2.1.0+debian-5_amd64.deb' added
  286. I: new cache content 'libsndfile1_1.0.28-5_amd64.deb' added
  287. I: new cache content 'libwrap0_7.6.q-28_amd64.deb' added
  288. I: new cache content 'libpulse0_12.2-4_amd64.deb' added
  289. I: new cache content 'liblavplay-2.1-0_1%3a2.1.0+debian-5_amd64.deb' added
  290. I: new cache content 'liblzo2-dev_2.10-0.1_amd64.deb' added
  291. I: new cache content 'libmpeg2encpp-2.1-0_1%3a2.1.0+debian-5_amd64.deb' added
  292. I: new cache content 'libmplex2-2.1-0_1%3a2.1.0+debian-5_amd64.deb' added
  293. I: new cache content 'libmjpegtools-dev_1%3a2.1.0+debian-5_amd64.deb' added
  294. I: new cache content 'libmp3lame-dev_3.100-2+b1_amd64.deb' added
  295. I: new cache content 'libmpeg2-4_0.5.1-8_amd64.deb' added
  296. I: new cache content 'libmpeg2-4-dev_0.5.1-8_amd64.deb' added
  297. I: new cache content 'libogg-dev_1.3.2-1+b1_amd64.deb' added
  298. I: new cache content 'libpostproc55_7%3a4.1.1-1_amd64.deb' added
  299. I: new cache content 'libpostproc-dev_7%3a4.1.1-1_amd64.deb' added
  300. I: new cache content 'libpulse-mainloop-glib0_12.2-4_amd64.deb' added
  301. I: new cache content 'libpulse-dev_12.2-4_amd64.deb' added
  302. I: new cache content 'libquicktime-dev_2%3a1.2.4-12+b2_amd64.deb' added
  303. I: new cache content 'libsdl1.2-dev_1.2.15+dfsg2-4_amd64.deb' added
  304. I: new cache content 'libswscale-dev_7%3a4.1.1-1_amd64.deb' added
  305. I: new cache content 'libtheora-dev_1.1.1+dfsg.1-15_amd64.deb' added
  306. I: new cache content 'libvorbis-dev_1.3.6-2_amd64.deb' added
  307. I: new cache content 'libxaw7-dev_2%3a1.0.13-1+b2_amd64.deb' added
  308. I: new cache content 'libxv-dev_2%3a1.0.11-1_amd64.deb' added
  309. I: Building the package
  310. I: Running cd /build/transcode-1.1.7/ && env PATH="/usr/sbin:/usr/bin:/sbin:/bin" HOME="/nonexistent" dpkg-buildpackage -us -uc 
  311. dpkg-buildpackage: info: source package transcode
  312. dpkg-buildpackage: info: source version 3:1.1.7-9.1
  313. dpkg-buildpackage: info: source distribution UNRELEASED
  314. dpkg-buildpackage: info: source changed by Matthias Erich Popp <oquo8ugh@gmx.de>
  315.  dpkg-source --before-build .
  316. dpkg-buildpackage: info: host architecture amd64
  317.  fakeroot debian/rules clean
  318. dh clean --parallel --with autoreconf
  319.    dh_auto_clean -O--parallel
  320.    dh_autoreconf_clean -O--parallel
  321.    dh_clean -O--parallel
  322.  dpkg-source -b .
  323. dpkg-source: info: using source format '3.0 (quilt)'
  324. dpkg-source: info: building transcode using existing ./transcode_1.1.7.orig.tar.bz2
  325. dpkg-source: info: using patch list from debian/patches/series
  326. dpkg-source: info: building transcode in transcode_1.1.7-9.1.debian.tar.xz
  327. dpkg-source: info: building transcode in transcode_1.1.7-9.1.dsc
  328.  debian/rules build
  329. dh build --parallel --with autoreconf
  330.    dh_update_autotools_config -O--parallel
  331.    dh_autoreconf -O--parallel
  332. aclocal: warning: autoconf input should be named 'configure.ac', not 'configure.in'
  333. libtoolize: putting auxiliary files in AC_CONFIG_AUX_DIR, 'autotools'.
  334. libtoolize: copying file 'autotools/ltmain.sh'
  335. libtoolize: Consider adding 'AC_CONFIG_MACRO_DIRS([m4])' to configure.in,
  336. libtoolize: and rerunning libtoolize and aclocal.
  337. libtoolize: Consider adding '-I m4' to ACLOCAL_AMFLAGS in Makefile.am.
  338. aclocal: warning: autoconf input should be named 'configure.ac', not 'configure.in'
  339. automake: warning: autoconf input should be named 'configure.ac', not 'configure.in'
  340. configure.in:10: warning: AM_INIT_AUTOMAKE: two- and three-arguments forms are deprecated.  For more info, see:
  341. configure.in:10: https://www.gnu.org/software/automake/manual/automake.html#Modernize-AM_005fINIT_005fAUTOMAKE-invocation
  342. configure.in:17: installing 'autotools/compile'
  343. configure.in:10: installing 'autotools/missing'
  344. automake: warning: autoconf input should be named 'configure.ac', not 'configure.in'
  345. aclib/Makefile.am: installing 'autotools/depcomp'
  346. export/Makefile.am:146: warning: source file '../pvm3/pvm_interface.c' is in a subdirectory,
  347. export/Makefile.am:146: but option 'subdir-objects' is disabled
  348. automake: warning: possible forward-incompatibility.
  349. automake: At least a source file is in a subdirectory, but the 'subdir-objects'
  350. automake: automake option hasn't been enabled.  For now, the corresponding output
  351. automake: object file(s) will be placed in the top-level directory.  However,
  352. automake: this behaviour will change in future Automake versions: they will
  353. automake: unconditionally cause object files to be placed in the same subdirectory
  354. automake: of the corresponding sources.
  355. automake: You are advised to start using 'subdir-objects' option throughout your
  356. automake: project, to avoid future incompatibilities.
  357. export/Makefile.am:146: warning: source file '../pvm3/pvm_parser.c' is in a subdirectory,
  358. export/Makefile.am:146: but option 'subdir-objects' is disabled
  359. export/Makefile.am:146: warning: source file '../pvm3/external_codec.c' is in a subdirectory,
  360. export/Makefile.am:146: but option 'subdir-objects' is disabled
  361. export/Makefile.am:146: warning: source file '../pvm3/vob_pack_unpack.c' is in a subdirectory,
  362. export/Makefile.am:146: but option 'subdir-objects' is disabled
  363. testsuite/Makefile.am:95: warning: source file '../src/export_profile.c' is in a subdirectory,
  364. testsuite/Makefile.am:95: but option 'subdir-objects' is disabled
  365. testsuite/Makefile.am:98: warning: source file '../pvm3/pvm_parser.c' is in a subdirectory,
  366. testsuite/Makefile.am:98: but option 'subdir-objects' is disabled
  367. tools/Makefile.am:116: warning: source file '../src/probe.c' is in a subdirectory,
  368. tools/Makefile.am:116: but option 'subdir-objects' is disabled
  369. tools/Makefile.am:116: warning: source file '../src/dl_loader.c' is in a subdirectory,
  370. tools/Makefile.am:116: but option 'subdir-objects' is disabled
  371. tools/Makefile.am:116: warning: source file '../src/counter.c' is in a subdirectory,
  372. tools/Makefile.am:116: but option 'subdir-objects' is disabled
  373. tools/Makefile.am:116: warning: source file '../src/encoder.c' is in a subdirectory,
  374. tools/Makefile.am:116: but option 'subdir-objects' is disabled
  375. tools/Makefile.am:116: warning: source file '../src/encoder-common.c' is in a subdirectory,
  376. tools/Makefile.am:116: but option 'subdir-objects' is disabled
  377. tools/Makefile.am:116: warning: source file '../src/export_profile.c' is in a subdirectory,
  378. tools/Makefile.am:116: but option 'subdir-objects' is disabled
  379. tools/Makefile.am:116: warning: source file '../src/framebuffer.c' is in a subdirectory,
  380. tools/Makefile.am:116: but option 'subdir-objects' is disabled
  381.   debian/rules override_dh_auto_configure
  382. make[1]: Entering directory '/build/transcode-1.1.7'
  383. dh_auto_configure -- --disable-3dnow --disable-altivec --disable-mmx --enable-a52 --enable-ffmpeg --enable-freetype2 --enable-iconv --enable-imagemagick --enable-lame --enable-libavcodec --enable-libavformat --enable-libavformat --enable-libdv --enable-libdvdread --enable-libjpeg --enable-libmpeg2 --enable-libmpeg2convert --enable-libpostproc --enable-libquicktime --enable-libxml2 --enable-lzo --enable-mjpegtools --enable-ogg --enable-oss --enable-sdl --enable-theora --enable-vorbis --enable-alsa --enable-v4l --libdir=/usr/lib
  384.         ./configure --build=x86_64-linux-gnu --prefix=/usr --includedir=\${prefix}/include --mandir=\${prefix}/share/man --infodir=\${prefix}/share/info --sysconfdir=/etc --localstatedir=/var --disable-silent-rules --libdir=\${prefix}/lib/x86_64-linux-gnu --libexecdir=\${prefix}/lib/x86_64-linux-gnu --disable-maintainer-mode --disable-dependency-tracking --disable-3dnow --disable-altivec --disable-mmx --enable-a52 --enable-ffmpeg --enable-freetype2 --enable-iconv --enable-imagemagick --enable-lame --enable-libavcodec --enable-libavformat --enable-libavformat --enable-libdv --enable-libdvdread --enable-libjpeg --enable-libmpeg2 --enable-libmpeg2convert --enable-libpostproc --enable-libquicktime --enable-libxml2 --enable-lzo --enable-mjpegtools --enable-ogg --enable-oss --enable-sdl --enable-theora --enable-vorbis --enable-alsa --enable-v4l --libdir=/usr/lib
  385. checking build system type... x86_64-pc-linux-gnu
  386. checking host system type... x86_64-pc-linux-gnu
  387. checking target system type... x86_64-pc-linux-gnu
  388. checking for a BSD-compatible install... /usr/bin/install -c
  389. checking whether build environment is sane... yes
  390. checking for a thread-safe mkdir -p... /bin/mkdir -p
  391. checking for gawk... awk
  392. checking whether make sets $(MAKE)... yes
  393. checking whether make supports nested variables... yes
  394. checking whether to enable maintainer-specific portions of Makefiles... no
  395. checking for gcc... gcc
  396. checking whether the C compiler works... yes
  397. checking for C compiler default output file name... a.out
  398. checking for suffix of executables...
  399. checking whether we are cross compiling... no
  400. checking for suffix of object files... o
  401. checking whether we are using the GNU C compiler... yes
  402. checking whether gcc accepts -g... yes
  403. checking for gcc option to accept ISO C89... none needed
  404. checking whether gcc understands -c and -o together... yes
  405. checking whether make supports the include directive... yes (GNU style)
  406. checking dependency style of gcc... none
  407. checking how to run the C preprocessor... gcc -E
  408. checking for gawk... (cached) awk
  409. checking whether ln -s works... yes
  410. checking whether make sets $(MAKE)... (cached) yes
  411. checking dependency style of gcc... none
  412. checking for awk... /usr/bin/awk
  413. checking for dlopen in -ldl... yes
  414. checking for dlopen... yes
  415. checking how to print strings... printf
  416. checking for a sed that does not truncate output... /bin/sed
  417. checking for grep that handles long lines and -e... /bin/grep
  418. checking for egrep... /bin/grep -E
  419. checking for fgrep... /bin/grep -F
  420. checking for ld used by gcc... /usr/bin/ld
  421. checking if the linker (/usr/bin/ld) is GNU ld... yes
  422. checking for BSD- or MS-compatible name lister (nm)... /usr/bin/nm -B
  423. checking the name lister (/usr/bin/nm -B) interface... BSD nm
  424. checking the maximum length of command line arguments... 1572864
  425. checking how to convert x86_64-pc-linux-gnu file names to x86_64-pc-linux-gnu format... func_convert_file_noop
  426. checking how to convert x86_64-pc-linux-gnu file names to toolchain format... func_convert_file_noop
  427. checking for /usr/bin/ld option to reload object files... -r
  428. checking for objdump... objdump
  429. checking how to recognize dependent libraries... pass_all
  430. checking for dlltool... no
  431. checking how to associate runtime and link libraries... printf %s\n
  432. checking for ar... ar
  433. checking for archiver @FILE support... @
  434. checking for strip... strip
  435. checking for ranlib... ranlib
  436. checking command to parse /usr/bin/nm -B output from gcc object... ok
  437. checking for sysroot... no
  438. checking for a working dd... /bin/dd
  439. checking how to truncate binary pipes... /bin/dd bs=4096 count=1
  440. checking for mt... no
  441. checking if : is a manifest tool... no
  442. checking for dlfcn.h... yes
  443. checking for objdir... .libs
  444. checking if gcc supports -fno-rtti -fno-exceptions... no
  445. checking for gcc option to produce PIC... -fPIC -DPIC
  446. checking if gcc PIC flag -fPIC -DPIC works... yes
  447. checking if gcc static flag -static works... yes
  448. checking if gcc supports -c -o file.o... yes
  449. checking if gcc supports -c -o file.o... (cached) yes
  450. checking whether the gcc linker (/usr/bin/ld -m elf_x86_64) supports shared libraries... yes
  451. checking whether -lc should be explicitly linked in... no
  452. checking dynamic linker characteristics... GNU/Linux ld.so
  453. checking how to hardcode library paths into programs... immediate
  454. checking for shl_load... no
  455. checking for shl_load in -ldld... no
  456. checking for dlopen... (cached) yes
  457. checking whether a program can dlopen itself... yes
  458. checking whether a statically linked program can dlopen itself... no
  459. checking whether stripping libraries is possible... yes
  460. checking if libtool supports shared libraries... yes
  461. checking whether to build shared libraries... yes
  462. checking whether to build static libraries... no
  463. checking for standard header files... yes
  464. checking endian.h usability... yes
  465. checking endian.h presence... yes
  466. checking for endian.h... yes
  467. checking malloc.h usability... yes
  468. checking malloc.h presence... yes
  469. checking for malloc.h... yes
  470. checking sys/mman.h usability... yes
  471. checking sys/mman.h presence... yes
  472. checking for sys/mman.h... yes
  473. checking sys/select.h usability... yes
  474. checking sys/select.h presence... yes
  475. checking for sys/select.h... yes
  476. checking for an ANSI C-conforming const... yes
  477. checking for inline... inline
  478. checking whether byte ordering is bigendian... no
  479. checking __attribute__((...)) support... yes
  480. checking __attribute__((aligned())) support... 64
  481. checking stdlib.h usability... yes
  482. checking stdlib.h presence... yes
  483. checking for stdlib.h... yes
  484. checking for GNU libc compatible malloc... yes
  485. checking return type of signal handlers... void
  486. checking for getopt_long_only... yes
  487. checking for getpagesize... yes
  488. checking for gettimeofday... yes
  489. checking for mmap... yes
  490. checking for strlcat... no
  491. checking for strlcpy... no
  492. checking for strtof... yes
  493. checking for vsscanf... yes
  494. checking for sysconf(_SC_PAGESIZE)... yes
  495. checking for special C compiler options needed for large files... no
  496. checking for _FILE_OFFSET_BITS value needed for large files... no
  497. checking for _LARGEFILE_SOURCE value needed for large files... no
  498. checking for pthreads in -lpthread... yes
  499. checking for build architecture... AMD64 architecture (AMD64)
  500. configure: WARNING: *** All MMX dependent parts will be disabled ***
  501. configure: WARNING: *** All 3DNow dependent parts will be disabled ***
  502. configure: WARNING: *** All SSE dependent parts will be disabled ***
  503. *** All SSE2 dependent parts will be disabled ***
  504. checking if $CC groks AltiVec inline assembly... no
  505. checking if $CC groks AltiVec C extensions... no
  506. checking if linker needs -framework vecLib...
  507. checking for pkg-config... /usr/bin/pkg-config
  508. checking pkg-config is at least version 0.20... yes
  509. checking for X... libraries , headers
  510. checking for gethostbyname... yes
  511. checking for connect... yes
  512. checking for remove... yes
  513. checking for shmat... yes
  514. checking for IceConnectionNumber in -lICE... yes
  515. checking for XvQueryExtension in -lXv... yes
  516. checking for XShmQueryExtension in -lX11... yes
  517. checking X11/Xaw/Simple.h usability... yes
  518. checking X11/Xaw/Simple.h presence... yes
  519. checking for X11/Xaw/Simple.h... yes
  520. checking for XpmFreeAttributes in -lXpm... yes
  521. checking for gzopen in -lz... yes
  522. checking for sin in -lm... yes
  523. checking for ffmpeg support... requested
  524. checking whether libavcodec support is requested... yes
  525. checking for LIBAVCODEC... yes
  526. checking whether libavformat support is requested... yes
  527. checking for LIBAVFORMAT... yes
  528. checking whether libavutil support is requested... yes
  529. checking for LIBAVUTIL... yes
  530. checking whether libavresample support is requested... yes
  531. checking for LIBAVRESAMPLE... yes
  532. checking whether libv4l2 support is requested... no
  533. checking whether libv4lconvert support is requested... no
  534. checking whether libmpeg2 support is requested... yes
  535. checking for LIBMPEG2... yes
  536. checking whether libmpeg2convert support is requested... yes
  537. checking for LIBMPEG2CONVERT... yes
  538. checking enable new or experimental components... no
  539. checking enable deprecated components... no
  540. checking for internal static framebuffer support... yes
  541. checking whether v4l support is requested... yes
  542. checking linux/videodev.h usability... no
  543. checking linux/videodev.h presence... no
  544. checking for linux/videodev.h... no
  545. checking for linux/videodev2.h... yes
  546. checking for struct v4l2_buffer in videodev2.h... yes
  547. checking whether bktr support is requested... no
  548. checking whether sunau support is requested... no
  549. checking whether OSS support is requested... yes
  550. checking sys/soundcard.h usability... yes
  551. checking sys/soundcard.h presence... yes
  552. checking for sys/soundcard.h... yes
  553. checking whether ALSA support is requested... yes
  554. checking alsa/asoundlib.h usability... yes
  555. checking alsa/asoundlib.h presence... yes
  556. checking for alsa/asoundlib.h... yes
  557. checking encore2.h usability... no
  558. checking encore2.h presence... no
  559. checking for encore2.h... no
  560. checking whether libpostproc support is requested... yes
  561. checking for LIBPOSTPROC... yes
  562. checking whether freetype2 support is requested... yes
  563. checking for FREETYPE2... yes
  564. checking whether lame support is requested... yes
  565. checking for pkgconfig support for lame... no
  566. checking how to determine LAME_CFLAGS... default
  567. checking how to determine LAME_LIBS... default
  568. checking for lame_init in -lmp3lame... yes
  569. checking lame/lame.h usability... yes
  570. checking lame/lame.h presence... yes
  571. checking for lame/lame.h... yes
  572. checking lame version... 3100
  573. checking whether xvid support is requested... no
  574. checking whether x264 support is requested... no
  575. checking whether ogg support is requested... yes
  576. checking for OGG... yes
  577. checking whether vorbis support is requested... yes
  578. checking for VORBIS... yes
  579. checking whether theora support is requested... yes
  580. checking for THEORA... yes
  581. checking whether libdvdread support is requested... yes
  582. checking for pkgconfig support for libdvdread... no
  583. checking how to determine LIBDVDREAD_CFLAGS... default
  584. checking how to determine LIBDVDREAD_LIBS... default
  585. checking for DVDOpen in -ldvdread... yes
  586. checking dvdread/dvd_reader.h usability... yes
  587. checking dvdread/dvd_reader.h presence... yes
  588. checking for dvdread/dvd_reader.h... yes
  589. checking whether pvm3 support is requested... no
  590. checking whether libdv support is requested... yes
  591. checking for LIBDV... yes
  592. checking whether libquicktime support is requested... yes
  593. checking for LIBQUICKTIME... yes
  594. checking for lqt_encode_video in -lquicktime... yes
  595. checking whether lzo support is requested... yes
  596. checking for pkgconfig support for lzo... no
  597. checking how to determine LZO_CFLAGS... default
  598. checking lzo/lzo1x.h usability... yes
  599. checking lzo/lzo1x.h presence... yes
  600. checking for lzo/lzo1x.h... yes
  601. checking how to determine LZO_LIBS... default
  602. checking for lzo_version in -llzo2... yes
  603. checking whether a52 support is requested... yes
  604. checking for pkgconfig support for a52... no
  605. checking how to determine A52_CFLAGS... default
  606. checking a52dec/a52.h usability... yes
  607. checking a52dec/a52.h presence... yes
  608. checking for a52dec/a52.h... yes
  609. checking how to determine A52_LIBS... default
  610. checking for a52_init in -la52... yes
  611. checking whether faac support is requested... no
  612. checking whether libxml2 support is requested... yes
  613. checking for LIBXML2... yes
  614. checking whether ibp and lors support is requested... no
  615. checking whether mjpegtools support is requested... yes
  616. checking for MJPEGTOOLS... yes
  617. checking whether sdl support is requested... yes
  618. checking for SDL... yes
  619. checking whether imagemagick support is requested... yes
  620. checking for pkgconfig support for imagemagick... yes
  621. checking how to determine IMAGEMAGICK_CFLAGS... pkg-config
  622. checking magick/api.h usability... yes
  623. checking magick/api.h presence... yes
  624. checking for magick/api.h... yes
  625. checking how to determine IMAGEMAGICK_LIBS... pkg-config
  626. checking wand/magick-wand.h usability... yes
  627. checking wand/magick-wand.h presence... yes
  628. checking for wand/magick-wand.h... yes
  629. checking whether libjpegmmx support is requested... no
  630. checking whether libjpeg support is requested... yes
  631. checking for pkgconfig support for libjpeg... no
  632. checking how to determine LIBJPEG_CFLAGS... default
  633. checking jpeglib.h usability... yes
  634. checking jpeglib.h presence... yes
  635. checking for jpeglib.h... yes
  636. checking how to determine LIBJPEG_LIBS... default
  637. checking for jpeg_CreateCompress in -ljpeg... yes
  638. checking whether bsdav support is requested... no
  639. checking whether iconv support is requested... yes
  640. checking for pkgconfig support for iconv... no
  641. checking how to determine ICONV_CFLAGS... default
  642. checking iconv.h usability... yes
  643. checking iconv.h presence... yes
  644. checking for iconv.h... yes
  645. checking how to determine ICONV_LIBS... default
  646. checking for iconv_open in -liconv... no
  647. checking for libiconv_open in -liconv... no
  648. checking for iconv_open in -lc... yes
  649. checking for PV3 support... no
  650. checking for NuppelVideo support... no
  651. checking if gcc supports -Wall -Wstrict-prototypes -Wmissing-prototypes -g -O2 -fdebug-prefix-map=/build/transcode-1.1.7=. -fstack-protector-strong -Wformat -Werror=format-security flags... yes
  652. checking that generated files are newer than configure... done
  653. configure: creating ./config.status
  654. config.status: creating Makefile
  655. config.status: creating aclib/Makefile
  656. config.status: creating avilib/Makefile
  657. config.status: creating docs/Makefile
  658. config.status: creating docs/html/Makefile
  659. config.status: creating docs/man/Makefile
  660. config.status: creating docs/pvm3/Makefile
  661. config.status: creating docs/tech/Makefile
  662. config.status: creating docs/tech/html/Makefile
  663. config.status: creating encode/Makefile
  664. config.status: creating export/Makefile
  665. config.status: creating filter/Makefile
  666. config.status: creating filter/divxkey/Makefile
  667. config.status: creating filter/extsub/Makefile
  668. config.status: creating filter/preview/Makefile
  669. config.status: creating filter/subtitler/Makefile
  670. config.status: creating filter/tomsmocomp/Makefile
  671. config.status: creating filter/yuvdenoise/Makefile
  672. config.status: creating filter/stabilize/Makefile
  673. config.status: creating import/Makefile
  674. config.status: creating import/framegen/Makefile
  675. config.status: creating import/nuv/Makefile
  676. config.status: creating import/v4l/Makefile
  677. config.status: creating multiplex/Makefile
  678. config.status: creating libdldarwin/Makefile
  679. config.status: creating libtc/Makefile
  680. config.status: creating libtcaudio/Makefile
  681. config.status: creating libtcvideo/Makefile
  682. config.status: creating pvm3/Makefile
  683. config.status: creating src/Makefile
  684. config.status: creating testsuite/Makefile
  685. config.status: creating tools/Makefile
  686. config.status: creating transcode.spec
  687. config.status: creating filter/parse_csv.awk
  688. config.status: creating filter/filter_list.awk
  689. config.status: creating config.h
  690. config.status: executing depfiles commands
  691. config.status: executing libtool commands
  692.  
  693. ----------------------------------------
  694. Summary for transcode 1.1.7:
  695. ----------------------------------------
  696.  
  697. core options
  698. ----------------------------------------
  699. enable experimental code       no
  700. enable deprecated code         no
  701. static AV-frame buffering      yes
  702. A52 default decoder            yes
  703. FFmpeg support                 yes
  704.  
  705. hardware support
  706. ----------------------------------------
  707. v4l (legacy)                   no
  708. v4l2                           yes
  709. ALSA                           yes
  710. OSS                            yes
  711. bktr                           no
  712. sunau                          no
  713.  
  714. optional module support
  715. ----------------------------------------
  716. PV3                            no
  717. NuppelVideo                    no
  718.  
  719. optional package support
  720. ----------------------------------------
  721. IBP (libxio)                   no
  722. X11                            yes
  723.    Xv      extension          yes
  724.    Xshm    extension          yes
  725.    Xaw     library            yes
  726.    Xpm     library            yes
  727.  
  728. libavcodec                     yes
  729. libavformat                    yes
  730. libavutil                      yes
  731. libavresample                  yes
  732. libv4l2                        no
  733. libv4lconvert                  no
  734. libmpeg2                       yes
  735. libmpeg2convert                yes
  736. libpostproc                    yes
  737. freetype2                      yes
  738. lame                           yes
  739. xvid                           no
  740. x264                           no
  741. ogg                            yes
  742. vorbis                         yes
  743. theora                         yes
  744. libdvdread                     yes
  745. pvm3                           no
  746. libdv                          yes
  747. libquicktime                   yes
  748. lzo                            yes
  749. a52                            yes
  750. faac                           no
  751. libxml2                        yes
  752. mjpegtools                     yes
  753. sdl                            yes
  754. imagemagick                    yes
  755. libjpeg                        yes
  756. bsdav                          no
  757. iconv                          yes
  758.  
  759.  
  760. make[1]: Leaving directory '/build/transcode-1.1.7'
  761.   dh_auto_build -O--parallel
  762.         make -j4
  763. make[1]: Entering directory '/build/transcode-1.1.7'
  764. make  all-recursive
  765. make[2]: Entering directory '/build/transcode-1.1.7'
  766. Making all in aclib
  767. make[3]: Entering directory '/build/transcode-1.1.7/aclib'
  768. /bin/bash ../libtool  --tag=CC   --mode=compile gcc -DHAVE_CONFIG_H -I. -I..  -D_REENTRANT -I.. -Wdate-time -D_FORTIFY_SOURCE=2  -Wall -Wstrict-prototypes -Wmissing-prototypes -g -O2 -fdebug-prefix-map=/build/transcode-1.1.7=. -fstack-protector-strong -Wformat -Werror=format-security -c -o accore.lo accore.c
  769. /bin/bash ../libtool  --tag=CC   --mode=compile gcc -DHAVE_CONFIG_H -I. -I..  -D_REENTRANT -I.. -Wdate-time -D_FORTIFY_SOURCE=2  -Wall -Wstrict-prototypes -Wmissing-prototypes -g -O2 -fdebug-prefix-map=/build/transcode-1.1.7=. -fstack-protector-strong -Wformat -Werror=format-security -c -o average.lo average.c
  770. /bin/bash ../libtool  --tag=CC   --mode=compile gcc -DHAVE_CONFIG_H -I. -I..  -D_REENTRANT -I.. -Wdate-time -D_FORTIFY_SOURCE=2  -Wall -Wstrict-prototypes -Wmissing-prototypes -g -O2 -fdebug-prefix-map=/build/transcode-1.1.7=. -fstack-protector-strong -Wformat -Werror=format-security -c -o imgconvert.lo imgconvert.c
  771. /bin/bash ../libtool  --tag=CC   --mode=compile gcc -DHAVE_CONFIG_H -I. -I..  -D_REENTRANT -I.. -Wdate-time -D_FORTIFY_SOURCE=2  -Wall -Wstrict-prototypes -Wmissing-prototypes -g -O2 -fdebug-prefix-map=/build/transcode-1.1.7=. -fstack-protector-strong -Wformat -Werror=format-security -c -o img_rgb_packed.lo img_rgb_packed.c
  772. libtool: compile:  gcc -DHAVE_CONFIG_H -I. -I.. -D_REENTRANT -I.. -Wdate-time -D_FORTIFY_SOURCE=2 -Wall -Wstrict-prototypes -Wmissing-prototypes -g -O2 -fdebug-prefix-map=/build/transcode-1.1.7=. -fstack-protector-strong -Wformat -Werror=format-security -c average.c  -fPIC -DPIC -o .libs/average.o
  773. libtool: compile:  gcc -DHAVE_CONFIG_H -I. -I.. -D_REENTRANT -I.. -Wdate-time -D_FORTIFY_SOURCE=2 -Wall -Wstrict-prototypes -Wmissing-prototypes -g -O2 -fdebug-prefix-map=/build/transcode-1.1.7=. -fstack-protector-strong -Wformat -Werror=format-security -c imgconvert.c  -fPIC -DPIC -o .libs/imgconvert.o
  774. libtool: compile:  gcc -DHAVE_CONFIG_H -I. -I.. -D_REENTRANT -I.. -Wdate-time -D_FORTIFY_SOURCE=2 -Wall -Wstrict-prototypes -Wmissing-prototypes -g -O2 -fdebug-prefix-map=/build/transcode-1.1.7=. -fstack-protector-strong -Wformat -Werror=format-security -c img_rgb_packed.c  -fPIC -DPIC -o .libs/img_rgb_packed.o
  775. libtool: compile:  gcc -DHAVE_CONFIG_H -I. -I.. -D_REENTRANT -I.. -Wdate-time -D_FORTIFY_SOURCE=2 -Wall -Wstrict-prototypes -Wmissing-prototypes -g -O2 -fdebug-prefix-map=/build/transcode-1.1.7=. -fstack-protector-strong -Wformat -Werror=format-security -c accore.c  -fPIC -DPIC -o .libs/accore.o
  776. /bin/bash ../libtool  --tag=CC   --mode=compile gcc -DHAVE_CONFIG_H -I. -I..  -D_REENTRANT -I.. -Wdate-time -D_FORTIFY_SOURCE=2  -Wall -Wstrict-prototypes -Wmissing-prototypes -g -O2 -fdebug-prefix-map=/build/transcode-1.1.7=. -fstack-protector-strong -Wformat -Werror=format-security -c -o img_yuv_mixed.lo img_yuv_mixed.c
  777. /bin/bash ../libtool  --tag=CC   --mode=compile gcc -DHAVE_CONFIG_H -I. -I..  -D_REENTRANT -I.. -Wdate-time -D_FORTIFY_SOURCE=2  -Wall -Wstrict-prototypes -Wmissing-prototypes -g -O2 -fdebug-prefix-map=/build/transcode-1.1.7=. -fstack-protector-strong -Wformat -Werror=format-security -c -o img_yuv_packed.lo img_yuv_packed.c
  778. libtool: compile:  gcc -DHAVE_CONFIG_H -I. -I.. -D_REENTRANT -I.. -Wdate-time -D_FORTIFY_SOURCE=2 -Wall -Wstrict-prototypes -Wmissing-prototypes -g -O2 -fdebug-prefix-map=/build/transcode-1.1.7=. -fstack-protector-strong -Wformat -Werror=format-security -c img_yuv_mixed.c  -fPIC -DPIC -o .libs/img_yuv_mixed.o
  779. libtool: compile:  gcc -DHAVE_CONFIG_H -I. -I.. -D_REENTRANT -I.. -Wdate-time -D_FORTIFY_SOURCE=2 -Wall -Wstrict-prototypes -Wmissing-prototypes -g -O2 -fdebug-prefix-map=/build/transcode-1.1.7=. -fstack-protector-strong -Wformat -Werror=format-security -c img_yuv_packed.c  -fPIC -DPIC -o .libs/img_yuv_packed.o
  780. /bin/bash ../libtool  --tag=CC   --mode=compile gcc -DHAVE_CONFIG_H -I. -I..  -D_REENTRANT -I.. -Wdate-time -D_FORTIFY_SOURCE=2  -Wall -Wstrict-prototypes -Wmissing-prototypes -g -O2 -fdebug-prefix-map=/build/transcode-1.1.7=. -fstack-protector-strong -Wformat -Werror=format-security -c -o img_yuv_planar.lo img_yuv_planar.c
  781. libtool: compile:  gcc -DHAVE_CONFIG_H -I. -I.. -D_REENTRANT -I.. -Wdate-time -D_FORTIFY_SOURCE=2 -Wall -Wstrict-prototypes -Wmissing-prototypes -g -O2 -fdebug-prefix-map=/build/transcode-1.1.7=. -fstack-protector-strong -Wformat -Werror=format-security -c img_yuv_planar.c  -fPIC -DPIC -o .libs/img_yuv_planar.o
  782. /bin/bash ../libtool  --tag=CC   --mode=compile gcc -DHAVE_CONFIG_H -I. -I..  -D_REENTRANT -I.. -Wdate-time -D_FORTIFY_SOURCE=2  -Wall -Wstrict-prototypes -Wmissing-prototypes -g -O2 -fdebug-prefix-map=/build/transcode-1.1.7=. -fstack-protector-strong -Wformat -Werror=format-security -c -o img_yuv_rgb.lo img_yuv_rgb.c
  783. libtool: compile:  gcc -DHAVE_CONFIG_H -I. -I.. -D_REENTRANT -I.. -Wdate-time -D_FORTIFY_SOURCE=2 -Wall -Wstrict-prototypes -Wmissing-prototypes -g -O2 -fdebug-prefix-map=/build/transcode-1.1.7=. -fstack-protector-strong -Wformat -Werror=format-security -c img_yuv_rgb.c  -fPIC -DPIC -o .libs/img_yuv_rgb.o
  784. /bin/bash ../libtool  --tag=CC   --mode=compile gcc -DHAVE_CONFIG_H -I. -I..  -D_REENTRANT -I.. -Wdate-time -D_FORTIFY_SOURCE=2  -Wall -Wstrict-prototypes -Wmissing-prototypes -g -O2 -fdebug-prefix-map=/build/transcode-1.1.7=. -fstack-protector-strong -Wformat -Werror=format-security -c -o memcpy.lo memcpy.c
  785. /bin/bash ../libtool  --tag=CC   --mode=compile gcc -DHAVE_CONFIG_H -I. -I..  -D_REENTRANT -I.. -Wdate-time -D_FORTIFY_SOURCE=2  -Wall -Wstrict-prototypes -Wmissing-prototypes -g -O2 -fdebug-prefix-map=/build/transcode-1.1.7=. -fstack-protector-strong -Wformat -Werror=format-security -c -o rescale.lo rescale.c
  786. libtool: compile:  gcc -DHAVE_CONFIG_H -I. -I.. -D_REENTRANT -I.. -Wdate-time -D_FORTIFY_SOURCE=2 -Wall -Wstrict-prototypes -Wmissing-prototypes -g -O2 -fdebug-prefix-map=/build/transcode-1.1.7=. -fstack-protector-strong -Wformat -Werror=format-security -c memcpy.c  -fPIC -DPIC -o .libs/memcpy.o
  787. libtool: compile:  gcc -DHAVE_CONFIG_H -I. -I.. -D_REENTRANT -I.. -Wdate-time -D_FORTIFY_SOURCE=2 -Wall -Wstrict-prototypes -Wmissing-prototypes -g -O2 -fdebug-prefix-map=/build/transcode-1.1.7=. -fstack-protector-strong -Wformat -Werror=format-security -c rescale.c  -fPIC -DPIC -o .libs/rescale.o
  788. /bin/bash ../libtool  --tag=CC   --mode=link gcc  -Wall -Wstrict-prototypes -Wmissing-prototypes -g -O2 -fdebug-prefix-map=/build/transcode-1.1.7=. -fstack-protector-strong -Wformat -Werror=format-security  -Wl,-z,relro -o libac.la  accore.lo average.lo imgconvert.lo img_rgb_packed.lo img_yuv_mixed.lo img_yuv_packed.lo img_yuv_planar.lo img_yuv_rgb.lo memcpy.lo rescale.lo  -lm -lz -ldl
  789. libtool: link: ar cru .libs/libac.a .libs/accore.o .libs/average.o .libs/imgconvert.o .libs/img_rgb_packed.o .libs/img_yuv_mixed.o .libs/img_yuv_packed.o .libs/img_yuv_planar.o .libs/img_yuv_rgb.o .libs/memcpy.o .libs/rescale.o
  790. ar: `u' modifier ignored since `D' is the default (see `U')
  791. libtool: link: ranlib .libs/libac.a
  792. libtool: link: ( cd ".libs" && rm -f "libac.la" && ln -s "../libac.la" "libac.la" )
  793. make[3]: Leaving directory '/build/transcode-1.1.7/aclib'
  794. Making all in avilib
  795. make[3]: Entering directory '/build/transcode-1.1.7/avilib'
  796. /bin/bash ../libtool  --tag=CC   --mode=compile gcc -DHAVE_CONFIG_H -I. -I..  -D_REENTRANT -I../libtc -I.. -Wdate-time -D_FORTIFY_SOURCE=2  -Wall -Wstrict-prototypes -Wmissing-prototypes -g -O2 -fdebug-prefix-map=/build/transcode-1.1.7=. -fstack-protector-strong -Wformat -Werror=format-security -c -o platform_posix.lo platform_posix.c
  797. /bin/bash ../libtool  --tag=CC   --mode=compile gcc -DHAVE_CONFIG_H -I. -I..  -D_REENTRANT -I../libtc -I.. -Wdate-time -D_FORTIFY_SOURCE=2  -Wall -Wstrict-prototypes -Wmissing-prototypes -g -O2 -fdebug-prefix-map=/build/transcode-1.1.7=. -fstack-protector-strong -Wformat -Werror=format-security -c -o avidump.lo avidump.c
  798. /bin/bash ../libtool  --tag=CC   --mode=compile gcc -DHAVE_CONFIG_H -I. -I..  -D_REENTRANT -I../libtc -I.. -Wdate-time -D_FORTIFY_SOURCE=2  -Wall -Wstrict-prototypes -Wmissing-prototypes -g -O2 -fdebug-prefix-map=/build/transcode-1.1.7=. -fstack-protector-strong -Wformat -Werror=format-security -c -o avilib.lo avilib.c
  799. /bin/bash ../libtool  --tag=CC   --mode=compile gcc -DHAVE_CONFIG_H -I. -I..  -D_REENTRANT -I../libtc -I.. -Wdate-time -D_FORTIFY_SOURCE=2  -Wall -Wstrict-prototypes -Wmissing-prototypes -g -O2 -fdebug-prefix-map=/build/transcode-1.1.7=. -fstack-protector-strong -Wformat -Werror=format-security -c -o wavlib.lo wavlib.c
  800. libtool: compile:  gcc -DHAVE_CONFIG_H -I. -I.. -D_REENTRANT -I../libtc -I.. -Wdate-time -D_FORTIFY_SOURCE=2 -Wall -Wstrict-prototypes -Wmissing-prototypes -g -O2 -fdebug-prefix-map=/build/transcode-1.1.7=. -fstack-protector-strong -Wformat -Werror=format-security -c avilib.c  -fPIC -DPIC -o .libs/avilib.o
  801. libtool: compile:  gcc -DHAVE_CONFIG_H -I. -I.. -D_REENTRANT -I../libtc -I.. -Wdate-time -D_FORTIFY_SOURCE=2 -Wall -Wstrict-prototypes -Wmissing-prototypes -g -O2 -fdebug-prefix-map=/build/transcode-1.1.7=. -fstack-protector-strong -Wformat -Werror=format-security -c platform_posix.c  -fPIC -DPIC -o .libs/platform_posix.o
  802. libtool: compile:  gcc -DHAVE_CONFIG_H -I. -I.. -D_REENTRANT -I../libtc -I.. -Wdate-time -D_FORTIFY_SOURCE=2 -Wall -Wstrict-prototypes -Wmissing-prototypes -g -O2 -fdebug-prefix-map=/build/transcode-1.1.7=. -fstack-protector-strong -Wformat -Werror=format-security -c wavlib.c  -fPIC -DPIC -o .libs/wavlib.o
  803. libtool: compile:  gcc -DHAVE_CONFIG_H -I. -I.. -D_REENTRANT -I../libtc -I.. -Wdate-time -D_FORTIFY_SOURCE=2 -Wall -Wstrict-prototypes -Wmissing-prototypes -g -O2 -fdebug-prefix-map=/build/transcode-1.1.7=. -fstack-protector-strong -Wformat -Werror=format-security -c avidump.c  -fPIC -DPIC -o .libs/avidump.o
  804. avilib.c: In function 'avi_ixnn_entry':
  805. avilib.c:176:30: warning: pointer targets in passing argument 1 of 'long2str' differ in signedness [-Wpointer-sign]
  806.  #define OUTD(n) long2str(ix00+bl,n); bl+=4
  807.                          ~~~~^~~
  808. avilib.c:210:5: note: in expansion of macro 'OUTD'
  809.      OUTD(ch->nEntriesInUse);
  810.      ^~~~
  811. avilib.c:77:13: note: expected 'unsigned char *' but argument is of type 'char *'
  812.  static void long2str(unsigned char *dst, int32_t n)
  813.              ^~~~~~~~
  814. avilib.c:176:30: warning: pointer targets in passing argument 1 of 'long2str' differ in signedness [-Wpointer-sign]
  815.  #define OUTD(n) long2str(ix00+bl,n); bl+=4
  816.                          ~~~~^~~
  817. avilib.c:212:5: note: in expansion of macro 'OUTD'
  818.      OUTD(ch->qwBaseOffset&0xffffffff);
  819.      ^~~~
  820. avilib.c:77:13: note: expected 'unsigned char *' but argument is of type 'char *'
  821.  static void long2str(unsigned char *dst, int32_t n)
  822.              ^~~~~~~~
  823. avilib.c:176:30: warning: pointer targets in passing argument 1 of 'long2str' differ in signedness [-Wpointer-sign]
  824.  #define OUTD(n) long2str(ix00+bl,n); bl+=4
  825.                          ~~~~^~~
  826. avilib.c:213:5: note: in expansion of macro 'OUTD'
  827.      OUTD((ch->qwBaseOffset>>32)&0xffffffff);
  828.      ^~~~
  829. avilib.c:77:13: note: expected 'unsigned char *' but argument is of type 'char *'
  830.  static void long2str(unsigned char *dst, int32_t n)
  831.              ^~~~~~~~
  832. avilib.c:176:30: warning: pointer targets in passing argument 1 of 'long2str' differ in signedness [-Wpointer-sign]
  833.  #define OUTD(n) long2str(ix00+bl,n); bl+=4
  834.                          ~~~~^~~
  835. avilib.c:214:5: note: in expansion of macro 'OUTD'
  836.      OUTD(ch->dwReserved3);
  837.      ^~~~
  838. avilib.c:77:13: note: expected 'unsigned char *' but argument is of type 'char *'
  839.  static void long2str(unsigned char *dst, int32_t n)
  840.              ^~~~~~~~
  841. avilib.c:176:30: warning: pointer targets in passing argument 1 of 'long2str' differ in signedness [-Wpointer-sign]
  842.  #define OUTD(n) long2str(ix00+bl,n); bl+=4
  843.                          ~~~~^~~
  844. avilib.c:217:6: note: in expansion of macro 'OUTD'
  845.       OUTD(ch->aIndex[k].dwOffset);
  846.       ^~~~
  847. avilib.c:77:13: note: expected 'unsigned char *' but argument is of type 'char *'
  848.  static void long2str(unsigned char *dst, int32_t n)
  849.              ^~~~~~~~
  850. avilib.c:176:30: warning: pointer targets in passing argument 1 of 'long2str' differ in signedness [-Wpointer-sign]
  851.  #define OUTD(n) long2str(ix00+bl,n); bl+=4
  852.                          ~~~~^~~
  853. avilib.c:218:6: note: in expansion of macro 'OUTD'
  854.       OUTD(ch->aIndex[k].dwSize);
  855.       ^~~~
  856. avilib.c:77:13: note: expected 'unsigned char *' but argument is of type 'char *'
  857.  static void long2str(unsigned char *dst, int32_t n)
  858.              ^~~~~~~~
  859. avilib.c:220:26: warning: pointer targets in passing argument 2 of 'avi_add_chunk' differ in signedness [-Wpointer-sign]
  860.      avi_add_chunk(AVI, ch->fcc, ix00, max);
  861.                         ~~^~~~~
  862. avilib.c:143:12: note: expected 'const unsigned char *' but argument is of type 'char *'
  863.  static int avi_add_chunk(avi_t *AVI, const unsigned char *tag,
  864.             ^~~~~~~~~~~~~
  865. avilib.c:220:33: warning: pointer targets in passing argument 3 of 'avi_add_chunk' differ in signedness [-Wpointer-sign]
  866.      avi_add_chunk(AVI, ch->fcc, ix00, max);
  867.                                  ^~~~
  868. avilib.c:143:12: note: expected 'const unsigned char *' but argument is of type 'char *'
  869.  static int avi_add_chunk(avi_t *AVI, const unsigned char *tag,
  870.             ^~~~~~~~~~~~~
  871. avilib.c: In function 'avi_add_odml_index_entry':
  872. avilib.c:338:26: warning: pointer targets in passing argument 1 of 'strchr' differ in signedness [-Wpointer-sign]
  873.      int audio = (strchr (tag, 'w')?1:0);
  874.                           ^~~
  875. In file included from avilib.h:38,
  876.                  from avilib.c:38:
  877. /usr/include/string.h:225:14: note: expected 'const char *' but argument is of type 'const unsigned char *'
  878.  extern char *strchr (const char *__s, int __c)
  879.               ^~~~~~
  880. avilib.c:348:36: warning: pointer targets in passing argument 2 of 'avi_init_super_index' differ in signedness [-Wpointer-sign]
  881.       if (avi_init_super_index(AVI, "ix00", &AVI->video_superindex) < 0) return -1;
  882.                                     ^~~~~~
  883. avilib.c:232:12: note: expected 'const unsigned char *' but argument is of type 'char *'
  884.  static int avi_init_super_index(avi_t *AVI, const unsigned char *idxtag,
  885.             ^~~~~~~~~~~~~~~~~~~~
  886. avilib.c:352:34: warning: pointer targets in passing argument 2 of 'avi_add_std_index' differ in signedness [-Wpointer-sign]
  887.       if (avi_add_std_index (AVI, "ix00", "00db", AVI->video_superindex->stdindex[ cur_std_idx ]) < 0)
  888.                                   ^~~~~~
  889. avilib.c:276:12: note: expected 'const unsigned char *' but argument is of type 'char *'
  890.  static int avi_add_std_index(avi_t *AVI, const unsigned char *idxtag,
  891.             ^~~~~~~~~~~~~~~~~
  892. avilib.c:352:42: warning: pointer targets in passing argument 3 of 'avi_add_std_index' differ in signedness [-Wpointer-sign]
  893.       if (avi_add_std_index (AVI, "ix00", "00db", AVI->video_superindex->stdindex[ cur_std_idx ]) < 0)
  894.                                           ^~~~~~
  895. avilib.c:276:12: note: expected 'const unsigned char *' but argument is of type 'char *'
  896.  static int avi_add_std_index(avi_t *AVI, const unsigned char *idxtag,
  897.             ^~~~~~~~~~~~~~~~~
  898. avilib.c:366:36: warning: pointer targets in passing argument 2 of 'avi_init_super_index' differ in signedness [-Wpointer-sign]
  899.       if (avi_init_super_index(AVI, fcc, &AVI->track[AVI->aptr].audio_superindex) < 0) return -1;
  900.                                     ^~~
  901. avilib.c:232:12: note: expected 'const unsigned char *' but argument is of type 'char *'
  902.  static int avi_init_super_index(avi_t *AVI, const unsigned char *idxtag,
  903.             ^~~~~~~~~~~~~~~~~~~~
  904. avilib.c:372:34: warning: pointer targets in passing argument 2 of 'avi_add_std_index' differ in signedness [-Wpointer-sign]
  905.       if (avi_add_std_index (AVI, fcc, tag, AVI->track[AVI->aptr].audio_superindex->stdindex[
  906.                                   ^~~
  907. avilib.c:276:12: note: expected 'const unsigned char *' but argument is of type 'char *'
  908.  static int avi_add_std_index(avi_t *AVI, const unsigned char *idxtag,
  909.             ^~~~~~~~~~~~~~~~~
  910. avilib.c:422:30: warning: pointer targets in passing argument 2 of 'avi_add_std_index' differ in signedness [-Wpointer-sign]
  911.   if (avi_add_std_index (AVI, "ix00", "00db", AVI->video_superindex->stdindex[ cur_std_idx ]) < 0)
  912.                               ^~~~~~
  913. avilib.c:276:12: note: expected 'const unsigned char *' but argument is of type 'char *'
  914.  static int avi_add_std_index(avi_t *AVI, const unsigned char *idxtag,
  915.             ^~~~~~~~~~~~~~~~~
  916. avilib.c:422:38: warning: pointer targets in passing argument 3 of 'avi_add_std_index' differ in signedness [-Wpointer-sign]
  917.   if (avi_add_std_index (AVI, "ix00", "00db", AVI->video_superindex->stdindex[ cur_std_idx ]) < 0)
  918.                                       ^~~~~~
  919. avilib.c:276:12: note: expected 'const unsigned char *' but argument is of type 'char *'
  920.  static int avi_add_std_index(avi_t *AVI, const unsigned char *idxtag,
  921.             ^~~~~~~~~~~~~~~~~
  922. avilib.c:435:34: warning: pointer targets in passing argument 2 of 'avi_add_std_index' differ in signedness [-Wpointer-sign]
  923.       if (avi_add_std_index (AVI, fcc, aud, AVI->track[audtr].audio_superindex->stdindex[
  924.                                   ^~~
  925. avilib.c:276:12: note: expected 'const unsigned char *' but argument is of type 'char *'
  926.  static int avi_add_std_index(avi_t *AVI, const unsigned char *idxtag,
  927.             ^~~~~~~~~~~~~~~~~
  928. avilib.c:435:39: warning: pointer targets in passing argument 3 of 'avi_add_std_index' differ in signedness [-Wpointer-sign]
  929.       if (avi_add_std_index (AVI, fcc, aud, AVI->track[audtr].audio_superindex->stdindex[
  930.                                        ^~~
  931. avilib.c:276:12: note: expected 'const unsigned char *' but argument is of type 'char *'
  932.  static int avi_add_std_index(avi_t *AVI, const unsigned char *idxtag,
  933.             ^~~~~~~~~~~~~~~~~
  934. avilib.c:472:50: warning: pointer targets in passing argument 3 of 'avi_add_chunk' differ in signedness [-Wpointer-sign]
  935.       avi_add_chunk(AVI, (unsigned char *)"RIFF", "AVIXLIST\0\0\0\0movi", 16);
  936.                                                   ^~~~~~~~~~~~~~~~~~~~~~
  937. avilib.c:143:12: note: expected 'const unsigned char *' but argument is of type 'char *'
  938.  static int avi_add_chunk(avi_t *AVI, const unsigned char *tag,
  939.             ^~~~~~~~~~~~~
  940. avilib.c: In function 'avi_parse_comments':
  941. avilib.c:1041:18: warning: pointer targets in passing argument 1 of 'long2str' differ in signedness [-Wpointer-sign]
  942.       long2str(buf+len, k+1); len += 4;
  943.                ~~~^~~~
  944. avilib.c:77:13: note: expected 'unsigned char *' but argument is of type 'char *'
  945.  static void long2str(unsigned char *dst, int32_t n)
  946.              ^~~~~~~~
  947. avilib.c:970:16: warning: variable 'readlen' set but not used [-Wunused-but-set-variable]
  948.      int len=0, readlen=0, k;
  949.                 ^~~~~~~
  950. avilib.c: In function 'avi_close_output_file':
  951. avilib.c:1558:62: warning: pointer targets in passing argument 2 of 'avi_parse_comments' differ in signedness [-Wpointer-sign]
  952.     info_len = avi_parse_comments (AVI->comment_fd, AVI_header+nhb, HEADERBYTES - nhb - 8 - 12);
  953.                                                     ~~~~~~~~~~^~~~
  954. avilib.c:968:12: note: expected 'char *' but argument is of type 'unsigned char *'
  955.  static int avi_parse_comments (int fd, char *buf, int space_left)
  956.             ^~~~~~~~~~~~~~~~~~
  957. avilib.c:1628:15: warning: pointer targets in passing argument 1 of 'long2str' differ in signedness [-Wpointer-sign]
  958.       long2str(f, len);
  959.                ^
  960. avilib.c:77:13: note: expected 'unsigned char *' but argument is of type 'char *'
  961.  static void long2str(unsigned char *dst, int32_t n)
  962.              ^~~~~~~~
  963. avilib.c:1634:15: warning: pointer targets in passing argument 1 of 'long2str' differ in signedness [-Wpointer-sign]
  964.       long2str(f, len);
  965.                ^
  966. avilib.c:77:13: note: expected 'unsigned char *' but argument is of type 'char *'
  967.  static void long2str(unsigned char *dst, int32_t n)
  968.              ^~~~~~~~
  969. avilib.c: In function 'plat_write_data':
  970. avilib.c:1693:50: warning: pointer targets in passing argument 3 of 'avi_add_chunk' differ in signedness [-Wpointer-sign]
  971.       n = avi_add_chunk(AVI,(unsigned char *)astr,data,length);
  972.                                                   ^~~~
  973. avilib.c:143:12: note: expected 'const unsigned char *' but argument is of type 'const char *'
  974.  static int avi_add_chunk(avi_t *AVI, const unsigned char *tag,
  975.             ^~~~~~~~~~~~~
  976. avilib.c:1695:52: warning: pointer targets in passing argument 3 of 'avi_add_chunk' differ in signedness [-Wpointer-sign]
  977.       n = avi_add_chunk(AVI,(unsigned char *)"00db",data,length);
  978.                                                     ^~~~
  979. avilib.c:143:12: note: expected 'const unsigned char *' but argument is of type 'const char *'
  980.  static int avi_add_chunk(avi_t *AVI, const unsigned char *tag,
  981.             ^~~~~~~~~~~~~
  982. avilib.c: In function 'avi_parse_input_file':
  983. avilib.c:2229:41: warning: pointer targets in passing argument 1 of 'strncasecmp' differ in signedness [-Wpointer-sign]
  984.           else if (strncasecmp (hdrl_data+i,"iavs",4) ==0 && ! auds_strh_seen) {
  985.                                 ~~~~~~~~~^~
  986. In file included from /usr/include/string.h:431,
  987.                  from avilib.h:38,
  988.                  from avilib.c:38:
  989. /usr/include/strings.h:120:12: note: expected 'const char *' but argument is of type 'uint8_t *' {aka 'unsigned char *'}
  990.  extern int strncasecmp (const char *__s1, const char *__s2, size_t __n)
  991.             ^~~~~~~~~~~
  992. avilib.c:2237:36: warning: pointer targets in passing argument 1 of 'strncasecmp' differ in signedness [-Wpointer-sign]
  993.        else if(strncasecmp(hdrl_data+i,"dmlh",4) == 0) {
  994.                            ~~~~~~~~~^~
  995. In file included from /usr/include/string.h:431,
  996.                  from avilib.h:38,
  997.                  from avilib.c:38:
  998. /usr/include/strings.h:120:12: note: expected 'const char *' but argument is of type 'uint8_t *' {aka 'unsigned char *'}
  999.  extern int strncasecmp (const char *__s1, const char *__s2, size_t __n)
  1000.             ^~~~~~~~~~~
  1001. avilib.c:2311:36: warning: pointer targets in passing argument 1 of 'strncasecmp' differ in signedness [-Wpointer-sign]
  1002.        else if(strncasecmp(hdrl_data+i,"indx",4) == 0) {
  1003.                            ~~~~~~~~~^~
  1004. In file included from /usr/include/string.h:431,
  1005.                  from avilib.h:38,
  1006.                  from avilib.c:38:
  1007. /usr/include/strings.h:120:12: note: expected 'const char *' but argument is of type 'uint8_t *' {aka 'unsigned char *'}
  1008.  extern int strncasecmp (const char *__s1, const char *__s2, size_t __n)
  1009.             ^~~~~~~~~~~
  1010. avilib.c:2318:8: warning: pointer targets in assignment from 'uint8_t *' {aka 'unsigned char *'} to 'char *' differ in signedness [-Wpointer-sign]
  1011.       a = hdrl_data+i;
  1012.         ^
  1013. avilib.c:2322:48: warning: pointer targets in passing argument 1 of 'str2ulong' differ in signedness [-Wpointer-sign]
  1014.       AVI->video_superindex->dwSize = str2ulong(a);          a += 4;
  1015.                                                 ^
  1016. avilib.c:103:17: note: expected 'unsigned char *' but argument is of type 'char *'
  1017.  static uint32_t str2ulong(unsigned char *str)
  1018.                  ^~~~~~~~~
  1019. avilib.c:2323:57: warning: pointer targets in passing argument 1 of 'str2ushort' differ in signedness [-Wpointer-sign]
  1020.       AVI->video_superindex->wLongsPerEntry = str2ushort(a); a += 2;
  1021.                                                          ^
  1022. avilib.c:107:17: note: expected 'unsigned char *' but argument is of type 'char *'
  1023.  static uint32_t str2ushort(unsigned char *str)
  1024.                  ^~~~~~~~~~
  1025. avilib.c:2326:55: warning: pointer targets in passing argument 1 of 'str2ulong' differ in signedness [-Wpointer-sign]
  1026.       AVI->video_superindex->nEntriesInUse = str2ulong(a);   a += 4;
  1027.                                                        ^
  1028. avilib.c:103:17: note: expected 'unsigned char *' but argument is of type 'char *'
  1029.  static uint32_t str2ulong(unsigned char *str)
  1030.                  ^~~~~~~~~
  1031. avilib.c:2341:65: warning: pointer targets in passing argument 1 of 'str2ullong' differ in signedness [-Wpointer-sign]
  1032.          AVI->video_superindex->aIndex[j].qwOffset = str2ullong (a);  a += 8;
  1033.                                                                  ^
  1034. avilib.c:96:17: note: expected 'unsigned char *' but argument is of type 'char *'
  1035.  static uint64_t str2ullong(unsigned char *str)
  1036.                  ^~~~~~~~~~
  1037. avilib.c:2342:62: warning: pointer targets in passing argument 1 of 'str2ulong' differ in signedness [-Wpointer-sign]
  1038.          AVI->video_superindex->aIndex[j].dwSize = str2ulong (a);     a += 4;
  1039.                                                               ^
  1040. avilib.c:103:17: note: expected 'unsigned char *' but argument is of type 'char *'
  1041.  static uint32_t str2ulong(unsigned char *str)
  1042.                  ^~~~~~~~~
  1043. avilib.c:2343:66: warning: pointer targets in passing argument 1 of 'str2ulong' differ in signedness [-Wpointer-sign]
  1044.          AVI->video_superindex->aIndex[j].dwDuration = str2ulong (a); a += 4;
  1045.                                                                   ^
  1046. avilib.c:103:17: note: expected 'unsigned char *' but argument is of type 'char *'
  1047.  static uint32_t str2ulong(unsigned char *str)
  1048.                  ^~~~~~~~~
  1049. avilib.c:2372:8: warning: pointer targets in assignment from 'uint8_t *' {aka 'unsigned char *'} to 'char *' differ in signedness [-Wpointer-sign]
  1050.       a = hdrl_data+i;
  1051.         ^
  1052. avilib.c:2376:80: warning: pointer targets in passing argument 2 of 'avi_build_audio_superindex' differ in signedness [-Wpointer-sign]
  1053.          a = avi_build_audio_superindex(AVI->track[AVI->aptr].audio_superindex, a);
  1054.                                                                                 ^
  1055. avilib.c:2032:17: note: expected 'uint8_t *' {aka 'unsigned char *'} but argument is of type 'char *'
  1056.  static uint8_t *avi_build_audio_superindex(avisuperindex_chunk *si, uint8_t *a)
  1057.                  ^~~~~~~~~~~~~~~~~~~~~~~~~~
  1058. avilib.c:2376:11: warning: pointer targets in assignment from 'uint8_t *' {aka 'unsigned char *'} to 'char *' differ in signedness [-Wpointer-sign]
  1059.          a = avi_build_audio_superindex(AVI->track[AVI->aptr].audio_superindex, a);
  1060.            ^
  1061. avidump.c: In function 'ProcessChunk':
  1062. avilib.c:2380:37: warning: pointer targets in passing argument 1 of 'strncasecmp' differ in signedness [-Wpointer-sign]
  1063.        else if((strncasecmp(hdrl_data+i,"JUNK",4) == 0) ||
  1064.                             ~~~~~~~~~^~
  1065. In file included from /usr/include/string.h:431,
  1066.                  from avilib.h:38,
  1067.                  from avilib.c:38:
  1068. /usr/include/strings.h:120:12: note: expected 'const char *' but argument is of type 'uint8_t *' {aka 'unsigned char *'}
  1069.  extern int strncasecmp (const char *__s1, const char *__s2, size_t __n)
  1070.             ^~~~~~~~~~~
  1071. avilib.c:2381:37: warning: pointer targets in passing argument 1 of 'strncasecmp' differ in signedness [-Wpointer-sign]
  1072.                (strncasecmp(hdrl_data+i,"strn",4) == 0) ||
  1073.                             ~~~~~~~~~^~
  1074. In file included from /usr/include/string.h:431,
  1075.                  from avilib.h:38,
  1076.                  from avilib.c:38:
  1077. /usr/include/strings.h:120:12: note: expected 'const char *' but argument is of type 'uint8_t *' {aka 'unsigned char *'}
  1078.  extern int strncasecmp (const char *__s1, const char *__s2, size_t __n)
  1079.             ^~~~~~~~~~~
  1080. avidump.c:473:11: warning: variable 'tt' set but not used [-Wunused-but-set-variable]
  1081.      off_t tt;
  1082.            ^~
  1083. avilib.c:2382:37: warning: pointer targets in passing argument 1 of 'strncasecmp' differ in signedness [-Wpointer-sign]
  1084.                (strncasecmp(hdrl_data+i,"vprp",4) == 0)){
  1085.                             ~~~~~~~~~^~
  1086. In file included from /usr/include/string.h:431,
  1087.                  from avilib.h:38,
  1088.                  from avilib.c:38:
  1089. /usr/include/strings.h:120:12: note: expected 'const char *' but argument is of type 'uint8_t *' {aka 'unsigned char *'}
  1090.  extern int strncasecmp (const char *__s1, const char *__s2, size_t __n)
  1091.             ^~~~~~~~~~~
  1092. avilib.c:2553:28: warning: pointer targets in passing argument 1 of 'str2ulong' differ in signedness [-Wpointer-sign]
  1093.    nrEntries = str2ulong(en + 12);
  1094.                          ~~~^~~~
  1095. avilib.c:103:17: note: expected 'unsigned char *' but argument is of type 'char *'
  1096.  static uint32_t str2ulong(unsigned char *str)
  1097.                  ^~~~~~~~~
  1098. avilib.c:2557:26: warning: pointer targets in passing argument 1 of 'str2ullong' differ in signedness [-Wpointer-sign]
  1099.    offset = str2ullong(en + 20);
  1100.                        ~~~^~~~
  1101. avilib.c:96:17: note: expected 'unsigned char *' but argument is of type 'char *'
  1102.  static uint64_t str2ullong(unsigned char *str)
  1103.                  ^~~~~~~~~~
  1104. avilib.c:2571:51: warning: pointer targets in passing argument 1 of 'str2ulong' differ in signedness [-Wpointer-sign]
  1105.       AVI->video_index[k].pos = offset + str2ulong(en); en += 4;
  1106.                                                    ^~
  1107. avilib.c:103:17: note: expected 'unsigned char *' but argument is of type 'char *'
  1108.  static uint32_t str2ulong(unsigned char *str)
  1109.                  ^~~~~~~~~
  1110. avilib.c:2572:46: warning: pointer targets in passing argument 1 of 'str2ulong_len' differ in signedness [-Wpointer-sign]
  1111.       AVI->video_index[k].len = str2ulong_len(en);
  1112.                                               ^~
  1113. avilib.c:113:17: note: expected 'unsigned char *' but argument is of type 'char *'
  1114.  static uint32_t str2ulong_len (unsigned char *str)
  1115.                  ^~~~~~~~~~~~~
  1116. avilib.c:2573:46: warning: pointer targets in passing argument 1 of 'str2ulong_key' differ in signedness [-Wpointer-sign]
  1117.       AVI->video_index[k].key = str2ulong_key(en); en += 4;
  1118.                                               ^~
  1119. In file included from avidump.c:40:
  1120. ../libtc/xio.h:44:18: warning: ignoring return value of 'read', declared with attribute warn_unused_result [-Wunused-result]
  1121.  #define xio_read read
  1122. avidump.c:581:2: note: in expansion of macro 'xio_read'
  1123.   xio_read(fd, &fcc_type,sizeof(FOURCC));
  1124.   ^~~~~~~~
  1125. avilib.c:120:17: note: expected 'unsigned char *' but argument is of type 'char *'
  1126.  static uint32_t str2ulong_key (unsigned char *str)
  1127.                  ^~~~~~~~~~~~~
  1128. ../libtc/xio.h:44:18: warning: ignoring return value of 'read', declared with attribute warn_unused_result [-Wunused-result]
  1129.  #define xio_read read
  1130. avidump.c:615:6: note: in expansion of macro 'xio_read'
  1131.       xio_read(fd, &offset,8);
  1132.       ^~~~~~~~
  1133. ../libtc/xio.h:44:18: warning: ignoring return value of 'read', declared with attribute warn_unused_result [-Wunused-result]
  1134.  #define xio_read read
  1135. avidump.c:616:6: note: in expansion of macro 'xio_read'
  1136.       xio_read(fd, &size, 4);
  1137.       ^~~~~~~~
  1138. ../libtc/xio.h:44:18: warning: ignoring return value of 'read', declared with attribute warn_unused_result [-Wunused-result]
  1139.  #define xio_read read
  1140. avidump.c:617:6: note: in expansion of macro 'xio_read'
  1141.       xio_read(fd, &duration,4);
  1142.       ^~~~~~~~
  1143. ../libtc/xio.h:44:18: warning: ignoring return value of 'read', declared with attribute warn_unused_result [-Wunused-result]
  1144.  #define xio_read read
  1145. avidump.c:639:6: note: in expansion of macro 'xio_read'
  1146.       xio_read(fd, &offset,4);
  1147.       ^~~~~~~~
  1148. avilib.c:2636:31: warning: pointer targets in passing argument 1 of 'str2ulong' differ in signedness [-Wpointer-sign]
  1149.       nrEntries = str2ulong(en + 12);
  1150.                             ~~~^~~~
  1151. avilib.c:103:17: note: expected 'unsigned char *' but argument is of type 'char *'
  1152.  static uint32_t str2ulong(unsigned char *str)
  1153.                  ^~~~~~~~~
  1154. ../libtc/xio.h:44:18: warning: ignoring return value of 'read', declared with attribute warn_unused_result [-Wunused-result]
  1155.  #define xio_read read
  1156. avidump.c:640:6: note: in expansion of macro 'xio_read'
  1157.       xio_read(fd, &size, 4);
  1158.       ^~~~~~~~
  1159. avilib.c:2641:29: warning: pointer targets in passing argument 1 of 'str2ullong' differ in signedness [-Wpointer-sign]
  1160.       offset = str2ullong(en + 20);
  1161.                           ~~~^~~~
  1162. avilib.c:96:17: note: expected 'unsigned char *' but argument is of type 'char *'
  1163.  static uint64_t str2ullong(unsigned char *str)
  1164.                  ^~~~~~~~~~
  1165. ../libtc/xio.h:44:18: warning: ignoring return value of 'read', declared with attribute warn_unused_result [-Wunused-result]
  1166.  #define xio_read read
  1167. avidump.c:663:6: note: in expansion of macro 'xio_read'
  1168.       xio_read(fd, &val32,4);
  1169.       ^~~~~~~~
  1170. avilib.c:2650:67: warning: pointer targets in passing argument 1 of 'str2ulong' differ in signedness [-Wpointer-sign]
  1171.          AVI->track[audtr].audio_index[k].pos = offset + str2ulong(en); en += 4;
  1172.                                                                    ^~
  1173. ../libtc/xio.h:44:18: warning: ignoring return value of 'read', declared with attribute warn_unused_result [-Wunused-result]
  1174.  #define xio_read read
  1175. avidump.c:679:6: note: in expansion of macro 'xio_read'
  1176.       xio_read(fd, &val32, 4);
  1177.       ^~~~~~~~
  1178. ../libtc/xio.h:44:18: warning: ignoring return value of 'read', declared with attribute warn_unused_result [-Wunused-result]
  1179.  #define xio_read read
  1180. avidump.c:684:6: note: in expansion of macro 'xio_read'
  1181.       xio_read(fd, &val32, 4);
  1182.       ^~~~~~~~
  1183. avilib.c:103:17: note: expected 'unsigned char *' but argument is of type 'char *'
  1184.  static uint32_t str2ulong(unsigned char *str)
  1185.                  ^~~~~~~~~
  1186. avilib.c:2651:62: warning: pointer targets in passing argument 1 of 'str2ulong_len' differ in signedness [-Wpointer-sign]
  1187.          AVI->track[audtr].audio_index[k].len = str2ulong_len(en); en += 4;
  1188.                                                               ^~
  1189. avilib.c:113:17: note: expected 'unsigned char *' but argument is of type 'char *'
  1190.  static uint32_t str2ulong_len (unsigned char *str)
  1191.                  ^~~~~~~~~~~~~
  1192. ../libtc/xio.h:44:18: warning: ignoring return value of 'read', declared with attribute warn_unused_result [-Wunused-result]
  1193.  #define xio_read read
  1194. avidump.c:689:6: note: in expansion of macro 'xio_read'
  1195.       xio_read(fd, &val32, 4);
  1196.       ^~~~~~~~
  1197. avidump.c: In function 'dump_vals':
  1198. ../libtc/xio.h:44:18: warning: ignoring return value of 'read', declared with attribute warn_unused_result [-Wunused-result]
  1199.  #define xio_read read
  1200. avidump.c:329:6: note: in expansion of macro 'xio_read'
  1201.       xio_read(fd, &val8, 1);
  1202.       ^~~~~~~~
  1203. ../libtc/xio.h:44:18: warning: ignoring return value of 'read', declared with attribute warn_unused_result [-Wunused-result]
  1204.  #define xio_read read
  1205. avidump.c:333:6: note: in expansion of macro 'xio_read'
  1206.       xio_read(fd, &val64, 8);
  1207.       ^~~~~~~~
  1208. ../libtc/xio.h:44:18: warning: ignoring return value of 'read', declared with attribute warn_unused_result [-Wunused-result]
  1209.  #define xio_read read
  1210. avidump.c:338:6: note: in expansion of macro 'xio_read'
  1211.       xio_read(fd, &val32, 4);
  1212.       ^~~~~~~~
  1213. ../libtc/xio.h:44:18: warning: ignoring return value of 'read', declared with attribute warn_unused_result [-Wunused-result]
  1214.  #define xio_read read
  1215. avidump.c:343:6: note: in expansion of macro 'xio_read'
  1216.       xio_read(fd, &val32,4);
  1217.       ^~~~~~~~
  1218. ../libtc/xio.h:44:18: warning: ignoring return value of 'read', declared with attribute warn_unused_result [-Wunused-result]
  1219.  #define xio_read read
  1220. avidump.c:357:6: note: in expansion of macro 'xio_read'
  1221.       xio_read(fd, &val32,4);
  1222.       ^~~~~~~~
  1223. ../libtc/xio.h:44:18: warning: ignoring return value of 'read', declared with attribute warn_unused_result [-Wunused-result]
  1224.  #define xio_read read
  1225. avidump.c:370:6: note: in expansion of macro 'xio_read'
  1226.       xio_read(fd, &val32,4);
  1227.       ^~~~~~~~
  1228. ../libtc/xio.h:44:18: warning: ignoring return value of 'read', declared with attribute warn_unused_result [-Wunused-result]
  1229.  #define xio_read read
  1230. avidump.c:381:6: note: in expansion of macro 'xio_read'
  1231.       xio_read(fd, &val16,2);
  1232.       ^~~~~~~~
  1233. ../libtc/xio.h:44:18: warning: ignoring return value of 'read', declared with attribute warn_unused_result [-Wunused-result]
  1234.  #define xio_read read
  1235. avidump.c:387:6: note: in expansion of macro 'xio_read'
  1236.       xio_read(fd, &val16,2);
  1237.       ^~~~~~~~
  1238. avidump.c: In function 'DumpChunk':
  1239. ../libtc/xio.h:44:18: warning: ignoring return value of 'read', declared with attribute warn_unused_result [-Wunused-result]
  1240.  #define xio_read read
  1241. avidump.c:761:7: note: in expansion of macro 'xio_read'
  1242.        xio_read(fd, &formtype,sizeof(FOURCC));    /* read the form type */
  1243.        ^~~~~~~~
  1244. avilib.c: In function 'avi_parse_index_from_file':
  1245. avilib.c:1946:5: warning: ignoring return value of 'fgets', declared with attribute warn_unused_result [-Wunused-result]
  1246.      fgets(data, 100, fd);
  1247.      ^~~~~~~~~~~~~~~~~~~~
  1248. avilib.c:1954:5: warning: ignoring return value of 'fgets', declared with attribute warn_unused_result [-Wunused-result]
  1249.      fgets(data, 100, fd);
  1250.      ^~~~~~~~~~~~~~~~~~~~
  1251. /bin/bash ../libtool  --tag=CC   --mode=link gcc  -Wall -Wstrict-prototypes -Wmissing-prototypes -g -O2 -fdebug-prefix-map=/build/transcode-1.1.7=. -fstack-protector-strong -Wformat -Werror=format-security  -Wl,-z,relro -o libwav.la  platform_posix.lo wavlib.lo  -lm -lz -ldl
  1252. libtool: link: ar cru .libs/libwav.a .libs/platform_posix.o .libs/wavlib.o
  1253. ar: `u' modifier ignored since `D' is the default (see `U')
  1254. libtool: link: ranlib .libs/libwav.a
  1255. libtool: link: ( cd ".libs" && rm -f "libwav.la" && ln -s "../libwav.la" "libwav.la" )
  1256. avilib.c: In function 'avi_add_odml_index_entry.isra.4':
  1257. avilib.c:371:36: warning: '%02d' directive output may be truncated writing between 2 and 11 bytes into a region of size 3 [-Wformat-truncation=]
  1258.      snprintf(fcc, sizeof(fcc), "ix%02d", AVI->aptr+1);
  1259.                                    ^~~~
  1260. avilib.c:371:33: note: directive argument in the range [-2147483647, 2147483647]
  1261.      snprintf(fcc, sizeof(fcc), "ix%02d", AVI->aptr+1);
  1262.                                 ^~~~~~~~
  1263. In file included from /usr/include/stdio.h:873,
  1264.                 from avilib.h:30,
  1265.                 from avilib.c:38:
  1266. /usr/include/x86_64-linux-gnu/bits/stdio2.h:67:10: note: '__builtin___snprintf_chk' output between 5 and 14 bytes into a destination of size 5
  1267.   return __builtin___snprintf_chk (__s, __n, __USE_FORTIFY_LEVEL - 1,
  1268.          ^~~~~~~~~~~~~~~~~~~~~~~~~~~~~~~~~~~~~~~~~~~~~~~~~~~~~~~~~~~~
  1269.        __bos (__s), __fmt, __va_arg_pack ());
  1270.        ~~~~~~~~~~~~~~~~~~~~~~~~~~~~~~~~~~~~~
  1271. avilib.c: In function 'AVI_write_frame':
  1272. avilib.c:1678:43: warning: '%1d' directive output may be truncated writing between 1 and 11 bytes into a region of size 4 [-Wformat-truncation=]
  1273.    snprintf((char *)astr, sizeof(astr), "0%1dwb", (int)(AVI->aptr+1));
  1274.                                           ^~~
  1275. avilib.c:1678:41: note: directive argument in the range [-2147483647, 2147483647]
  1276.    snprintf((char *)astr, sizeof(astr), "0%1dwb", (int)(AVI->aptr+1));
  1277.                                         ^~~~~~~~
  1278. In file included from /usr/include/stdio.h:873,
  1279.                 from avilib.h:30,
  1280.                 from avilib.c:38:
  1281. /usr/include/x86_64-linux-gnu/bits/stdio2.h:67:10: note: '__builtin___snprintf_chk' output between 5 and 15 bytes into a destination of size 5
  1282.   return __builtin___snprintf_chk (__s, __n, __USE_FORTIFY_LEVEL - 1,
  1283.          ^~~~~~~~~~~~~~~~~~~~~~~~~~~~~~~~~~~~~~~~~~~~~~~~~~~~~~~~~~~~
  1284.        __bos (__s), __fmt, __va_arg_pack ());
  1285.        ~~~~~~~~~~~~~~~~~~~~~~~~~~~~~~~~~~~~~
  1286. avilib.c: In function 'AVI_write_audio':
  1287. avilib.c:1678:43: warning: '%1d' directive output may be truncated writing between 1 and 11 bytes into a region of size 4 [-Wformat-truncation=]
  1288.    snprintf((char *)astr, sizeof(astr), "0%1dwb", (int)(AVI->aptr+1));
  1289.                                           ^~~
  1290. avilib.c:1678:41: note: directive argument in the range [-2147483647, 2147483647]
  1291.    snprintf((char *)astr, sizeof(astr), "0%1dwb", (int)(AVI->aptr+1));
  1292.                                         ^~~~~~~~
  1293. In file included from /usr/include/stdio.h:873,
  1294.                 from avilib.h:30,
  1295.                 from avilib.c:38:
  1296. /usr/include/x86_64-linux-gnu/bits/stdio2.h:67:10: note: '__builtin___snprintf_chk' output between 5 and 15 bytes into a destination of size 5
  1297.   return __builtin___snprintf_chk (__s, __n, __USE_FORTIFY_LEVEL - 1,
  1298.          ^~~~~~~~~~~~~~~~~~~~~~~~~~~~~~~~~~~~~~~~~~~~~~~~~~~~~~~~~~~~
  1299.        __bos (__s), __fmt, __va_arg_pack ());
  1300.        ~~~~~~~~~~~~~~~~~~~~~~~~~~~~~~~~~~~~~
  1301. /bin/bash ../libtool  --tag=CC   --mode=link gcc  -Wall -Wstrict-prototypes -Wmissing-prototypes -g -O2 -fdebug-prefix-map=/build/transcode-1.1.7=. -fstack-protector-strong -Wformat -Werror=format-security  -Wl,-z,relro -o libavi.la  platform_posix.lo avidump.lo avilib.lo  -lm -lz -ldl
  1302. libtool: link: ar cru .libs/libavi.a .libs/platform_posix.o .libs/avidump.o .libs/avilib.o
  1303. ar: `u' modifier ignored since `D' is the default (see `U')
  1304. libtool: link: ranlib .libs/libavi.a
  1305. libtool: link: ( cd ".libs" && rm -f "libavi.la" && ln -s "../libavi.la" "libavi.la" )
  1306. make[3]: Leaving directory '/build/transcode-1.1.7/avilib'
  1307. Making all in libtc
  1308. make[3]: Entering directory '/build/transcode-1.1.7/libtc'
  1309. /bin/bash ../libtool  --tag=CC   --mode=compile gcc -DHAVE_CONFIG_H -I. -I..  -D_REENTRANT -I.. -I../src -Wdate-time -D_FORTIFY_SOURCE=2  -Wall -Wstrict-prototypes -Wmissing-prototypes -g -O2 -fdebug-prefix-map=/build/transcode-1.1.7=. -fstack-protector-strong -Wformat -Werror=format-security -c -o cfgfile.lo cfgfile.c
  1310. /bin/bash ../libtool  --tag=CC   --mode=compile gcc -DHAVE_CONFIG_H -I. -I..  -D_REENTRANT -I.. -I../src -Wdate-time -D_FORTIFY_SOURCE=2  -Wall -Wstrict-prototypes -Wmissing-prototypes -g -O2 -fdebug-prefix-map=/build/transcode-1.1.7=. -fstack-protector-strong -Wformat -Werror=format-security -c -o framecode.lo framecode.c
  1311. /bin/bash ../libtool  --tag=CC   --mode=compile gcc -DHAVE_CONFIG_H -I. -I..  -D_REENTRANT -I.. -I../src -Wdate-time -D_FORTIFY_SOURCE=2  -Wall -Wstrict-prototypes -Wmissing-prototypes -g -O2 -fdebug-prefix-map=/build/transcode-1.1.7=. -fstack-protector-strong -Wformat -Werror=format-security -c -o iodir.lo iodir.c
  1312. /bin/bash ../libtool  --tag=CC   --mode=compile gcc -DHAVE_CONFIG_H -I. -I..  -D_REENTRANT -I.. -I../src -Wdate-time -D_FORTIFY_SOURCE=2  -Wall -Wstrict-prototypes -Wmissing-prototypes -g -O2 -fdebug-prefix-map=/build/transcode-1.1.7=. -fstack-protector-strong -Wformat -Werror=format-security -c -o optstr.lo optstr.c
  1313. libtool: compile:  gcc -DHAVE_CONFIG_H -I. -I.. -D_REENTRANT -I.. -I../src -Wdate-time -D_FORTIFY_SOURCE=2 -Wall -Wstrict-prototypes -Wmissing-prototypes -g -O2 -fdebug-prefix-map=/build/transcode-1.1.7=. -fstack-protector-strong -Wformat -Werror=format-security -c optstr.c  -fPIC -DPIC -o .libs/optstr.o
  1314. libtool: compile:  gcc -DHAVE_CONFIG_H -I. -I.. -D_REENTRANT -I.. -I../src -Wdate-time -D_FORTIFY_SOURCE=2 -Wall -Wstrict-prototypes -Wmissing-prototypes -g -O2 -fdebug-prefix-map=/build/transcode-1.1.7=. -fstack-protector-strong -Wformat -Werror=format-security -c framecode.c  -fPIC -DPIC -o .libs/framecode.o
  1315. libtool: compile:  gcc -DHAVE_CONFIG_H -I. -I.. -D_REENTRANT -I.. -I../src -Wdate-time -D_FORTIFY_SOURCE=2 -Wall -Wstrict-prototypes -Wmissing-prototypes -g -O2 -fdebug-prefix-map=/build/transcode-1.1.7=. -fstack-protector-strong -Wformat -Werror=format-security -c cfgfile.c  -fPIC -DPIC -o .libs/cfgfile.o
  1316. libtool: compile:  gcc -DHAVE_CONFIG_H -I. -I.. -D_REENTRANT -I.. -I../src -Wdate-time -D_FORTIFY_SOURCE=2 -Wall -Wstrict-prototypes -Wmissing-prototypes -g -O2 -fdebug-prefix-map=/build/transcode-1.1.7=. -fstack-protector-strong -Wformat -Werror=format-security -c iodir.c  -fPIC -DPIC -o .libs/iodir.o
  1317. /bin/bash ../libtool  --tag=CC   --mode=compile gcc -DHAVE_CONFIG_H -I. -I..  -D_REENTRANT -I.. -I../src -Wdate-time -D_FORTIFY_SOURCE=2  -Wall -Wstrict-prototypes -Wmissing-prototypes -g -O2 -fdebug-prefix-map=/build/transcode-1.1.7=. -fstack-protector-strong -Wformat -Werror=format-security -c -o ratiocodes.lo ratiocodes.c
  1318. /bin/bash ../libtool  --tag=CC   --mode=compile gcc -DHAVE_CONFIG_H -I. -I..  -D_REENTRANT -I.. -I../src -Wdate-time -D_FORTIFY_SOURCE=2  -Wall -Wstrict-prototypes -Wmissing-prototypes -g -O2 -fdebug-prefix-map=/build/transcode-1.1.7=. -fstack-protector-strong -Wformat -Werror=format-security -c -o strlcat.lo strlcat.c
  1319. libtool: compile:  gcc -DHAVE_CONFIG_H -I. -I.. -D_REENTRANT -I.. -I../src -Wdate-time -D_FORTIFY_SOURCE=2 -Wall -Wstrict-prototypes -Wmissing-prototypes -g -O2 -fdebug-prefix-map=/build/transcode-1.1.7=. -fstack-protector-strong -Wformat -Werror=format-security -c ratiocodes.c  -fPIC -DPIC -o .libs/ratiocodes.o
  1320. libtool: compile:  gcc -DHAVE_CONFIG_H -I. -I.. -D_REENTRANT -I.. -I../src -Wdate-time -D_FORTIFY_SOURCE=2 -Wall -Wstrict-prototypes -Wmissing-prototypes -g -O2 -fdebug-prefix-map=/build/transcode-1.1.7=. -fstack-protector-strong -Wformat -Werror=format-security -c strlcat.c  -fPIC -DPIC -o .libs/strlcat.o
  1321. /bin/bash ../libtool  --tag=CC   --mode=compile gcc -DHAVE_CONFIG_H -I. -I..  -D_REENTRANT -I.. -I../src -Wdate-time -D_FORTIFY_SOURCE=2  -Wall -Wstrict-prototypes -Wmissing-prototypes -g -O2 -fdebug-prefix-map=/build/transcode-1.1.7=. -fstack-protector-strong -Wformat -Werror=format-security -c -o strlcpy.lo strlcpy.c
  1322. libtool: compile:  gcc -DHAVE_CONFIG_H -I. -I.. -D_REENTRANT -I.. -I../src -Wdate-time -D_FORTIFY_SOURCE=2 -Wall -Wstrict-prototypes -Wmissing-prototypes -g -O2 -fdebug-prefix-map=/build/transcode-1.1.7=. -fstack-protector-strong -Wformat -Werror=format-security -c strlcpy.c  -fPIC -DPIC -o .libs/strlcpy.o
  1323. /bin/bash ../libtool  --tag=CC   --mode=compile gcc -DHAVE_CONFIG_H -I. -I..  -D_REENTRANT -I.. -I../src -Wdate-time -D_FORTIFY_SOURCE=2  -Wall -Wstrict-prototypes -Wmissing-prototypes -g -O2 -fdebug-prefix-map=/build/transcode-1.1.7=. -fstack-protector-strong -Wformat -Werror=format-security -c -o tc_functions.lo tc_functions.c
  1324. /bin/bash ../libtool  --tag=CC   --mode=compile gcc -DHAVE_CONFIG_H -I. -I..  -D_REENTRANT -I.. -I../src -Wdate-time -D_FORTIFY_SOURCE=2  -Wall -Wstrict-prototypes -Wmissing-prototypes -g -O2 -fdebug-prefix-map=/build/transcode-1.1.7=. -fstack-protector-strong -Wformat -Werror=format-security -c -o tccodecs.lo tccodecs.c
  1325. libtool: compile:  gcc -DHAVE_CONFIG_H -I. -I.. -D_REENTRANT -I.. -I../src -Wdate-time -D_FORTIFY_SOURCE=2 -Wall -Wstrict-prototypes -Wmissing-prototypes -g -O2 -fdebug-prefix-map=/build/transcode-1.1.7=. -fstack-protector-strong -Wformat -Werror=format-security -c tc_functions.c  -fPIC -DPIC -o .libs/tc_functions.o
  1326. /bin/bash ../libtool  --tag=CC   --mode=compile gcc -DHAVE_CONFIG_H -I. -I..  -D_REENTRANT -I.. -I../src -Wdate-time -D_FORTIFY_SOURCE=2  -Wall -Wstrict-prototypes -Wmissing-prototypes -g -O2 -fdebug-prefix-map=/build/transcode-1.1.7=. -fstack-protector-strong -Wformat -Werror=format-security -c -o tcframes.lo tcframes.c
  1327. libtool: compile:  gcc -DHAVE_CONFIG_H -I. -I.. -D_REENTRANT -I.. -I../src -Wdate-time -D_FORTIFY_SOURCE=2 -Wall -Wstrict-prototypes -Wmissing-prototypes -g -O2 -fdebug-prefix-map=/build/transcode-1.1.7=. -fstack-protector-strong -Wformat -Werror=format-security -c tccodecs.c  -fPIC -DPIC -o .libs/tccodecs.o
  1328. /bin/bash ../libtool  --tag=CC   --mode=compile gcc -DHAVE_CONFIG_H -I. -I..  -D_REENTRANT -I.. -I../src -Wdate-time -D_FORTIFY_SOURCE=2  -Wall -Wstrict-prototypes -Wmissing-prototypes -g -O2 -fdebug-prefix-map=/build/transcode-1.1.7=. -fstack-protector-strong -Wformat -Werror=format-security -c -o tcglob.lo tcglob.c
  1329. libtool: compile:  gcc -DHAVE_CONFIG_H -I. -I.. -D_REENTRANT -I.. -I../src -Wdate-time -D_FORTIFY_SOURCE=2 -Wall -Wstrict-prototypes -Wmissing-prototypes -g -O2 -fdebug-prefix-map=/build/transcode-1.1.7=. -fstack-protector-strong -Wformat -Werror=format-security -c tcframes.c  -fPIC -DPIC -o .libs/tcframes.o
  1330. libtool: compile:  gcc -DHAVE_CONFIG_H -I. -I.. -D_REENTRANT -I.. -I../src -Wdate-time -D_FORTIFY_SOURCE=2 -Wall -Wstrict-prototypes -Wmissing-prototypes -g -O2 -fdebug-prefix-map=/build/transcode-1.1.7=. -fstack-protector-strong -Wformat -Werror=format-security -c tcglob.c  -fPIC -DPIC -o .libs/tcglob.o
  1331. /bin/bash ../libtool  --tag=CC   --mode=compile gcc -DHAVE_CONFIG_H -I. -I..  -D_REENTRANT -I.. -I../src -Wdate-time -D_FORTIFY_SOURCE=2  -Wall -Wstrict-prototypes -Wmissing-prototypes -g -O2 -fdebug-prefix-map=/build/transcode-1.1.7=. -fstack-protector-strong -Wformat -Werror=format-security -c -o tclist.lo tclist.c
  1332. /bin/bash ../libtool  --tag=CC   --mode=compile gcc -DHAVE_CONFIG_H -I. -I..  -D_REENTRANT -I.. -I../src -Wdate-time -D_FORTIFY_SOURCE=2  -Wall -Wstrict-prototypes -Wmissing-prototypes -g -O2 -fdebug-prefix-map=/build/transcode-1.1.7=. -fstack-protector-strong -Wformat -Werror=format-security -c -o tcmodule.lo tcmodule.c
  1333. libtool: compile:  gcc -DHAVE_CONFIG_H -I. -I.. -D_REENTRANT -I.. -I../src -Wdate-time -D_FORTIFY_SOURCE=2 -Wall -Wstrict-prototypes -Wmissing-prototypes -g -O2 -fdebug-prefix-map=/build/transcode-1.1.7=. -fstack-protector-strong -Wformat -Werror=format-security -c tclist.c  -fPIC -DPIC -o .libs/tclist.o
  1334. /bin/bash ../libtool  --tag=CC   --mode=compile gcc -DHAVE_CONFIG_H -I. -I..  -D_REENTRANT -I.. -I../src -Wdate-time -D_FORTIFY_SOURCE=2  -Wall -Wstrict-prototypes -Wmissing-prototypes -g -O2 -fdebug-prefix-map=/build/transcode-1.1.7=. -fstack-protector-strong -Wformat -Werror=format-security -c -o tcmoduleinfo.lo tcmoduleinfo.c
  1335. libtool: compile:  gcc -DHAVE_CONFIG_H -I. -I.. -D_REENTRANT -I.. -I../src -Wdate-time -D_FORTIFY_SOURCE=2 -Wall -Wstrict-prototypes -Wmissing-prototypes -g -O2 -fdebug-prefix-map=/build/transcode-1.1.7=. -fstack-protector-strong -Wformat -Werror=format-security -c tcmodule.c  -fPIC -DPIC -o .libs/tcmodule.o
  1336. libtool: compile:  gcc -DHAVE_CONFIG_H -I. -I.. -D_REENTRANT -I.. -I../src -Wdate-time -D_FORTIFY_SOURCE=2 -Wall -Wstrict-prototypes -Wmissing-prototypes -g -O2 -fdebug-prefix-map=/build/transcode-1.1.7=. -fstack-protector-strong -Wformat -Werror=format-security -c tcmoduleinfo.c  -fPIC -DPIC -o .libs/tcmoduleinfo.o
  1337. /bin/bash ../libtool  --tag=CC   --mode=compile gcc -DHAVE_CONFIG_H -I. -I..  -D_REENTRANT -I.. -I../src -Wdate-time -D_FORTIFY_SOURCE=2  -Wall -Wstrict-prototypes -Wmissing-prototypes -g -O2 -fdebug-prefix-map=/build/transcode-1.1.7=. -fstack-protector-strong -Wformat -Werror=format-security -c -o tctimer.lo tctimer.c
  1338. libtool: compile:  gcc -DHAVE_CONFIG_H -I. -I.. -D_REENTRANT -I.. -I../src -Wdate-time -D_FORTIFY_SOURCE=2 -Wall -Wstrict-prototypes -Wmissing-prototypes -g -O2 -fdebug-prefix-map=/build/transcode-1.1.7=. -fstack-protector-strong -Wformat -Werror=format-security -c tctimer.c  -fPIC -DPIC -o .libs/tctimer.o
  1339. /bin/bash ../libtool  --tag=CC   --mode=link gcc  -Wall -Wstrict-prototypes -Wmissing-prototypes -g -O2 -fdebug-prefix-map=/build/transcode-1.1.7=. -fstack-protector-strong -Wformat -Werror=format-security  -Wl,-z,relro -o libtc.la  cfgfile.lo framecode.lo iodir.lo optstr.lo ratiocodes.lo strlcat.lo strlcpy.lo tc_functions.lo tccodecs.lo tcframes.lo tcglob.lo tclist.lo tcmodule.lo tcmoduleinfo.lo  tctimer.lo   -lm -lz -ldl
  1340. libtool: link: ar cru .libs/libtc.a .libs/cfgfile.o .libs/framecode.o .libs/iodir.o .libs/optstr.o .libs/ratiocodes.o .libs/strlcat.o .libs/strlcpy.o .libs/tc_functions.o .libs/tccodecs.o .libs/tcframes.o .libs/tcglob.o .libs/tclist.o .libs/tcmodule.o .libs/tcmoduleinfo.o .libs/tctimer.o
  1341. ar: `u' modifier ignored since `D' is the default (see `U')
  1342. libtool: link: ranlib .libs/libtc.a
  1343. libtool: link: ( cd ".libs" && rm -f "libtc.la" && ln -s "../libtc.la" "libtc.la" )
  1344. make[3]: Leaving directory '/build/transcode-1.1.7/libtc'
  1345. Making all in libtcaudio
  1346. make[3]: Entering directory '/build/transcode-1.1.7/libtcaudio'
  1347. /bin/bash ../libtool  --tag=CC   --mode=compile gcc -DHAVE_CONFIG_H -I. -I..  -I.. -Wdate-time -D_FORTIFY_SOURCE=2  -Wall -Wstrict-prototypes -Wmissing-prototypes -g -O2 -fdebug-prefix-map=/build/transcode-1.1.7=. -fstack-protector-strong -Wformat -Werror=format-security -c -o tcaudio.lo tcaudio.c
  1348. libtool: compile:  gcc -DHAVE_CONFIG_H -I. -I.. -I.. -Wdate-time -D_FORTIFY_SOURCE=2 -Wall -Wstrict-prototypes -Wmissing-prototypes -g -O2 -fdebug-prefix-map=/build/transcode-1.1.7=. -fstack-protector-strong -Wformat -Werror=format-security -c tcaudio.c  -fPIC -DPIC -o .libs/tcaudio.o
  1349. /bin/bash ../libtool  --tag=CC   --mode=link gcc  -Wall -Wstrict-prototypes -Wmissing-prototypes -g -O2 -fdebug-prefix-map=/build/transcode-1.1.7=. -fstack-protector-strong -Wformat -Werror=format-security  -Wl,-z,relro -o libtcaudio.la  tcaudio.lo  -lm -lz -ldl
  1350. libtool: link: ar cru .libs/libtcaudio.a .libs/tcaudio.o
  1351. ar: `u' modifier ignored since `D' is the default (see `U')
  1352. libtool: link: ranlib .libs/libtcaudio.a
  1353. libtool: link: ( cd ".libs" && rm -f "libtcaudio.la" && ln -s "../libtcaudio.la" "libtcaudio.la" )
  1354. make[3]: Leaving directory '/build/transcode-1.1.7/libtcaudio'
  1355. Making all in libtcvideo
  1356. make[3]: Entering directory '/build/transcode-1.1.7/libtcvideo'
  1357. /bin/bash ../libtool  --tag=CC   --mode=compile gcc -DHAVE_CONFIG_H -I. -I..  -I.. -Wdate-time -D_FORTIFY_SOURCE=2  -Wall -Wstrict-prototypes -Wmissing-prototypes -g -O2 -fdebug-prefix-map=/build/transcode-1.1.7=. -fstack-protector-strong -Wformat -Werror=format-security -c -o tcvideo.lo tcvideo.c
  1358. /bin/bash ../libtool  --tag=CC   --mode=compile gcc -DHAVE_CONFIG_H -I. -I..  -I.. -Wdate-time -D_FORTIFY_SOURCE=2  -Wall -Wstrict-prototypes -Wmissing-prototypes -g -O2 -fdebug-prefix-map=/build/transcode-1.1.7=. -fstack-protector-strong -Wformat -Werror=format-security -c -o zoom.lo zoom.c
  1359. libtool: compile:  gcc -DHAVE_CONFIG_H -I. -I.. -I.. -Wdate-time -D_FORTIFY_SOURCE=2 -Wall -Wstrict-prototypes -Wmissing-prototypes -g -O2 -fdebug-prefix-map=/build/transcode-1.1.7=. -fstack-protector-strong -Wformat -Werror=format-security -c tcvideo.c  -fPIC -DPIC -o .libs/tcvideo.o
  1360. libtool: compile:  gcc -DHAVE_CONFIG_H -I. -I.. -I.. -Wdate-time -D_FORTIFY_SOURCE=2 -Wall -Wstrict-prototypes -Wmissing-prototypes -g -O2 -fdebug-prefix-map=/build/transcode-1.1.7=. -fstack-protector-strong -Wformat -Werror=format-security -c zoom.c  -fPIC -DPIC -o .libs/zoom.o
  1361. /bin/bash ../libtool  --tag=CC   --mode=link gcc  -Wall -Wstrict-prototypes -Wmissing-prototypes -g -O2 -fdebug-prefix-map=/build/transcode-1.1.7=. -fstack-protector-strong -Wformat -Werror=format-security  -Wl,-z,relro -o libtcvideo.la  tcvideo.lo zoom.lo  -lm -lz -ldl
  1362. libtool: link: ar cru .libs/libtcvideo.a .libs/tcvideo.o .libs/zoom.o
  1363. ar: `u' modifier ignored since `D' is the default (see `U')
  1364. libtool: link: ranlib .libs/libtcvideo.a
  1365. libtool: link: ( cd ".libs" && rm -f "libtcvideo.la" && ln -s "../libtcvideo.la" "libtcvideo.la" )
  1366. make[3]: Leaving directory '/build/transcode-1.1.7/libtcvideo'
  1367. Making all in encode
  1368. make[3]: Entering directory '/build/transcode-1.1.7/encode'
  1369. make[3]: Nothing to be done for 'all'.
  1370. make[3]: Leaving directory '/build/transcode-1.1.7/encode'
  1371. Making all in export
  1372. make[3]: Entering directory '/build/transcode-1.1.7/export'
  1373. /bin/bash ../libtool  --tag=CC   --mode=compile gcc -DHAVE_CONFIG_H -I. -I..  -D_REENTRANT -DMOD_PATH=\"/usr/lib/transcode\" -I.. -I../src -Wdate-time -D_FORTIFY_SOURCE=2  -Wall -Wstrict-prototypes -Wmissing-prototypes -g -O2 -fdebug-prefix-map=/build/transcode-1.1.7=. -fstack-protector-strong -Wformat -Werror=format-security -c -o export_ac3.lo export_ac3.c
  1374. /bin/bash ../libtool  --tag=CC   --mode=compile gcc -DHAVE_CONFIG_H -I. -I..  -D_REENTRANT -DMOD_PATH=\"/usr/lib/transcode\" -I.. -I../src -I/usr/include/x86_64-linux-gnu -I/usr/include -Wdate-time -D_FORTIFY_SOURCE=2  -Wall -Wstrict-prototypes -Wmissing-prototypes -g -O2 -fdebug-prefix-map=/build/transcode-1.1.7=. -fstack-protector-strong -Wformat -Werror=format-security -c -o export_divx5_la-export_divx5.lo `test -f 'export_divx5.c' || echo './'`export_divx5.c
  1375. /bin/bash ../libtool  --tag=CC   --mode=compile gcc -DHAVE_CONFIG_H -I. -I..  -D_REENTRANT -DMOD_PATH=\"/usr/lib/transcode\" -I.. -I../src -I/usr/include/x86_64-linux-gnu -I/usr/include -Wdate-time -D_FORTIFY_SOURCE=2  -Wall -Wstrict-prototypes -Wmissing-prototypes -g -O2 -fdebug-prefix-map=/build/transcode-1.1.7=. -fstack-protector-strong -Wformat -Werror=format-security -c -o export_divx5_la-aud_aux.lo `test -f 'aud_aux.c' || echo './'`aud_aux.c
  1376. /bin/bash ../libtool  --tag=CC   --mode=compile gcc -DHAVE_CONFIG_H -I. -I..  -D_REENTRANT -DMOD_PATH=\"/usr/lib/transcode\" -I.. -I../src -I/usr/include/x86_64-linux-gnu -I/usr/include -Wdate-time -D_FORTIFY_SOURCE=2  -Wall -Wstrict-prototypes -Wmissing-prototypes -g -O2 -fdebug-prefix-map=/build/transcode-1.1.7=. -fstack-protector-strong -Wformat -Werror=format-security -c -o export_divx5_la-divx4_vbr.lo `test -f 'divx4_vbr.c' || echo './'`divx4_vbr.c
  1377. libtool: compile:  gcc -DHAVE_CONFIG_H -I. -I.. -D_REENTRANT -DMOD_PATH=\"/usr/lib/transcode\" -I.. -I../src -Wdate-time -D_FORTIFY_SOURCE=2 -Wall -Wstrict-prototypes -Wmissing-prototypes -g -O2 -fdebug-prefix-map=/build/transcode-1.1.7=. -fstack-protector-strong -Wformat -Werror=format-security -c export_ac3.c  -fPIC -DPIC -o .libs/export_ac3.o
  1378. libtool: compile:  gcc -DHAVE_CONFIG_H -I. -I.. -D_REENTRANT -DMOD_PATH=\"/usr/lib/transcode\" -I.. -I../src -I/usr/include/x86_64-linux-gnu -I/usr/include -Wdate-time -D_FORTIFY_SOURCE=2 -Wall -Wstrict-prototypes -Wmissing-prototypes -g -O2 -fdebug-prefix-map=/build/transcode-1.1.7=. -fstack-protector-strong -Wformat -Werror=format-security -c export_divx5.c  -fPIC -DPIC -o .libs/export_divx5_la-export_divx5.o
  1379. libtool: compile:  gcc -DHAVE_CONFIG_H -I. -I.. -D_REENTRANT -DMOD_PATH=\"/usr/lib/transcode\" -I.. -I../src -I/usr/include/x86_64-linux-gnu -I/usr/include -Wdate-time -D_FORTIFY_SOURCE=2 -Wall -Wstrict-prototypes -Wmissing-prototypes -g -O2 -fdebug-prefix-map=/build/transcode-1.1.7=. -fstack-protector-strong -Wformat -Werror=format-security -c divx4_vbr.c  -fPIC -DPIC -o .libs/export_divx5_la-divx4_vbr.o
  1380. libtool: compile:  gcc -DHAVE_CONFIG_H -I. -I.. -D_REENTRANT -DMOD_PATH=\"/usr/lib/transcode\" -I.. -I../src -I/usr/include/x86_64-linux-gnu -I/usr/include -Wdate-time -D_FORTIFY_SOURCE=2 -Wall -Wstrict-prototypes -Wmissing-prototypes -g -O2 -fdebug-prefix-map=/build/transcode-1.1.7=. -fstack-protector-strong -Wformat -Werror=format-security -c aud_aux.c  -fPIC -DPIC -o .libs/export_divx5_la-aud_aux.o
  1381. export_ac3.c: In function 'export_ac3_encode':
  1382. export_ac3.c:146:27: warning: pointer targets in passing argument 1 of 'p_write' differ in signedness [-Wpointer-sign]
  1383.         if (p_write (param->buffer, param->size) != param->size)
  1384.                      ~~~~~^~~~~~~~
  1385. export_ac3.c:41:19: note: expected 'char *' but argument is of type 'uint8_t *' {aka 'unsigned char *'}
  1386. static inline int p_write (char *buf, size_t len)
  1387.                   ^~~~~~~
  1388. export_divx5.c: In function 'export_divx5_encode':
  1389. export_divx5.c:699:59: warning: pointer targets in passing argument 1 of 'tc_audio_encode' differ in signedness [-Wpointer-sign]
  1390.   if(param->flag == TC_AUDIO) return(tc_audio_encode(param->buffer, param->size, avifile));
  1391.                                                      ~~~~~^~~~~~~~
  1392. In file included from export_divx5.c:62:
  1393. aud_aux.h:33:5: note: expected 'char *' but argument is of type 'uint8_t *' {aka 'unsigned char *'}
  1394. int tc_audio_encode(char *aud_buffer, int aud_size, avi_t *avifile);
  1395.     ^~~~~~~~~~~~~~~
  1396. divx4_vbr.c: In function 'VbrControl_init_2pass_vbr_encoding':
  1397. divx4_vbr.c:151:5: warning: ignoring return value of 'fread', declared with attribute warn_unused_result [-Wunused-result]
  1398.     fread(head, 10, 1, m_pFile);
  1399.     ^~~~~~~~~~~~~~~~~~~~~~~~~~~
  1400. divx4_vbr.c:157:9: warning: ignoring return value of 'fscanf', declared with attribute warn_unused_result [-Wunused-result]
  1401.         fscanf(m_pFile, "%d\n", &version);
  1402.         ^~~~~~~~~~~~~~~~~~~~~~~~~~~~~~~~~
  1403. divx4_vbr.c:158:9: warning: ignoring return value of 'fscanf', declared with attribute warn_unused_result [-Wunused-result]
  1404.         fscanf(m_pFile, "quality %d\n", &iOldQual);
  1405.         ^~~~~~~~~~~~~~~~~~~~~~~~~~~~~~~~~~~~~~~~~~
  1406. divx4_vbr.c:204:9: warning: ignoring return value of 'fscanf', declared with attribute warn_unused_result [-Wunused-result]
  1407.         fscanf(m_pFile, "Frame %d: intra %d, quant %d, texture %d, "
  1408.         ^~~~~~~~~~~~~~~~~~~~~~~~~~~~~~~~~~~~~~~~~~~~~~~~~~~~~~~~~~~~
  1409.                         "motion %d, total %d\n",
  1410.                         ~~~~~~~~~~~~~~~~~~~~~~~~
  1411.                &iNumFrames, (int *) &(vFrame.is_key_frame),
  1412.                ~~~~~~~~~~~~~~~~~~~~~~~~~~~~~~~~~~~~~~~~~~~~
  1413.                &(vFrame.quant), &(vFrame.text_bits),
  1414.                ~~~~~~~~~~~~~~~~~~~~~~~~~~~~~~~~~~~~~
  1415.                &(vFrame.motion_bits), &(vFrame.total_bits));
  1416.                ~~~~~~~~~~~~~~~~~~~~~~~~~~~~~~~~~~~~~~~~~~~~
  1417. divx4_vbr.c:236:9: warning: ignoring return value of 'fscanf', declared with attribute warn_unused_result [-Wunused-result]
  1418.         fscanf(m_pFile, "Frame %d: intra %d, quant %d, texture %d, "
  1419.         ^~~~~~~~~~~~~~~~~~~~~~~~~~~~~~~~~~~~~~~~~~~~~~~~~~~~~~~~~~~~
  1420.                         "motion %d, total %d\n",
  1421.                         ~~~~~~~~~~~~~~~~~~~~~~~~
  1422.                &dummy, (int *) &(m_vFrames[i].is_key_frame),
  1423.                ~~~~~~~~~~~~~~~~~~~~~~~~~~~~~~~~~~~~~~~~~~~~~
  1424.                &(m_vFrames[i].quant), &(m_vFrames[i].text_bits),
  1425.                ~~~~~~~~~~~~~~~~~~~~~~~~~~~~~~~~~~~~~~~~~~~~~~~~~
  1426.                &(m_vFrames[i].motion_bits), &(m_vFrames[i].total_bits));
  1427.                ~~~~~~~~~~~~~~~~~~~~~~~~~~~~~~~~~~~~~~~~~~~~~~~~~~~~~~~~
  1428. aud_aux.c: In function 'tc_audio_init_ffmpeg':
  1429. aud_aux.c:325:5: warning: 'avcodec_register_all' is deprecated [-Wdeprecated-declarations]
  1430.     TC_INIT_LIBAVCODEC;
  1431.     ^~~~~~~~~~~~~~~~~~
  1432. In file included from ../libtc/tcavcodec.h:33,
  1433.                 from aud_aux.c:48:
  1434. /usr/include/x86_64-linux-gnu/libavcodec/avcodec.h:4102:6: note: declared here
  1435. void avcodec_register_all(void);
  1436.      ^~~~~~~~~~~~~~~~~~~~
  1437. aud_aux.c: In function 'tc_audio_encode_mp3':
  1438. aud_aux.c:757:23: warning: pointer targets in passing argument 5 of 'lame_encode_buffer' differ in signedness [-Wpointer-sign]
  1439.                 output+output_len,
  1440.                 ~~~~~~^~~~~~~~~~~
  1441. In file included from aud_aux.c:41:
  1442. /usr/include/lame/lame.h:716:11: note: expected 'unsigned char *' but argument is of type 'char *'
  1443. int CDECL lame_encode_buffer (
  1444.           ^~~~~~~~~~~~~~~~~~
  1445. aud_aux.c:764:24: warning: pointer targets in passing argument 4 of 'lame_encode_buffer_interleaved' differ in signedness [-Wpointer-sign]
  1446.                 output + output_len,
  1447.                 ~~~~~~~^~~~~~~~~~~~
  1448. In file included from aud_aux.c:41:
  1449. /usr/include/lame/lame.h:731:11: note: expected 'unsigned char *' but argument is of type 'char *'
  1450. int CDECL lame_encode_buffer_interleaved(
  1451.           ^~~~~~~~~~~~~~~~~~~~~~~~~~~~~~
  1452. aud_aux.c:814:45: warning: pointer targets in passing argument 1 of 'tc_get_mp3_header' differ in signedness [-Wpointer-sign]
  1453.         while((size=tc_get_mp3_header(output+offset, NULL, NULL)) > 0)
  1454.                                       ~~~~~~^~~~~~~
  1455. aud_aux.c:140:12: note: expected 'unsigned char *' but argument is of type 'char *'
  1456. static int tc_get_mp3_header(unsigned char* hbuf, int* chans, int* srate);
  1457.            ^~~~~~~~~~~~~~~~~
  1458. aud_aux.c: In function 'tc_audio_encode_ffmpeg':
  1459. aud_aux.c:870:16: warning: implicit declaration of function 'avcodec_encode_audio'; did you mean 'avcodec_encode_audio2'? [-Wimplicit-function-declaration]
  1460.     out_size = avcodec_encode_audio(&mpa_ctx, (unsigned char *)output,
  1461.                ^~~~~~~~~~~~~~~~~~~~
  1462.                avcodec_encode_audio2
  1463. aud_aux.c: In function 'tc_audio_close':
  1464. aud_aux.c:1038:46: warning: pointer targets in passing argument 2 of 'lame_encode_flush' differ in signedness [-Wpointer-sign]
  1465.             outsize = lame_encode_flush(lgf, output, 0);
  1466.                                              ^~~~~~
  1467. In file included from aud_aux.c:41:
  1468. /usr/include/lame/lame.h:875:11: note: expected 'unsigned char *' but argument is of type 'char *'
  1469. int CDECL lame_encode_flush(
  1470.           ^~~~~~~~~~~~~~~~~
  1471. /bin/bash ../libtool  --tag=CC   --mode=compile gcc -DHAVE_CONFIG_H -I. -I..  -D_REENTRANT -DMOD_PATH=\"/usr/lib/transcode\" -I.. -I../src  -I/usr/include/x86_64-linux-gnu -I/usr/include -Wdate-time -D_FORTIFY_SOURCE=2  -Wall -Wstrict-prototypes -Wmissing-prototypes -g -O2 -fdebug-prefix-map=/build/transcode-1.1.7=. -fstack-protector-strong -Wformat -Werror=format-security -c -o export_dv_la-export_dv.lo `test -f 'export_dv.c' || echo './'`export_dv.c
  1472. /bin/bash ../libtool  --tag=CC   --mode=compile gcc -DHAVE_CONFIG_H -I. -I..  -D_REENTRANT -DMOD_PATH=\"/usr/lib/transcode\" -I.. -I../src  -I/usr/include/x86_64-linux-gnu -I/usr/include -Wdate-time -D_FORTIFY_SOURCE=2  -Wall -Wstrict-prototypes -Wmissing-prototypes -g -O2 -fdebug-prefix-map=/build/transcode-1.1.7=. -fstack-protector-strong -Wformat -Werror=format-security -c -o export_dv_la-aud_aux.lo `test -f 'aud_aux.c' || echo './'`aud_aux.c
  1473. libtool: compile:  gcc -DHAVE_CONFIG_H -I. -I.. -D_REENTRANT -DMOD_PATH=\"/usr/lib/transcode\" -I.. -I../src -I/usr/include/x86_64-linux-gnu -I/usr/include -Wdate-time -D_FORTIFY_SOURCE=2 -Wall -Wstrict-prototypes -Wmissing-prototypes -g -O2 -fdebug-prefix-map=/build/transcode-1.1.7=. -fstack-protector-strong -Wformat -Werror=format-security -c export_dv.c  -fPIC -DPIC -o .libs/export_dv_la-export_dv.o
  1474. /bin/bash ../libtool  --tag=CC   --mode=compile gcc -DHAVE_CONFIG_H -I. -I..  -D_REENTRANT -DMOD_PATH=\"/usr/lib/transcode\" -I.. -I../src  -Wdate-time -D_FORTIFY_SOURCE=2  -Wall -Wstrict-prototypes -Wmissing-prototypes -g -O2 -fdebug-prefix-map=/build/transcode-1.1.7=. -fstack-protector-strong -Wformat -Werror=format-security -c -o export_dvraw_la-export_dvraw.lo `test -f 'export_dvraw.c' || echo './'`export_dvraw.c
  1475. export_dv.c: In function 'export_dv_encode':
  1476. export_dv.c:199:33: warning: pointer targets in passing argument 2 of 'AVI_write_frame' differ in signedness [-Wpointer-sign]
  1477.     if(AVI_write_frame(avifile, target, frame_size, key)<0) {
  1478.                                 ^~~~~~
  1479. In file included from ../src/transcode.h:44,
  1480.                 from export_dv.c:28:
  1481. ../avilib/avilib.h:329:6: note: expected 'const char *' but argument is of type 'unsigned char *'
  1482. int  AVI_write_frame(avi_t *AVI, const char *data, long bytes, int keyframe);
  1483.      ^~~~~~~~~~~~~~~
  1484. export_dv.c:207:59: warning: pointer targets in passing argument 1 of 'tc_audio_encode' differ in signedness [-Wpointer-sign]
  1485.   if(param->flag == TC_AUDIO) return(tc_audio_encode(param->buffer, param->size, avifile));
  1486.                                                      ~~~~~^~~~~~~~
  1487. In file included from export_dv.c:30:
  1488. aud_aux.h:33:5: note: expected 'char *' but argument is of type 'uint8_t *' {aka 'unsigned char *'}
  1489. int tc_audio_encode(char *aud_buffer, int aud_size, avi_t *avifile);
  1490.     ^~~~~~~~~~~~~~~
  1491. libtool: compile:  gcc -DHAVE_CONFIG_H -I. -I.. -D_REENTRANT -DMOD_PATH=\"/usr/lib/transcode\" -I.. -I../src -I/usr/include/x86_64-linux-gnu -I/usr/include -Wdate-time -D_FORTIFY_SOURCE=2 -Wall -Wstrict-prototypes -Wmissing-prototypes -g -O2 -fdebug-prefix-map=/build/transcode-1.1.7=. -fstack-protector-strong -Wformat -Werror=format-security -c aud_aux.c  -fPIC -DPIC -o .libs/export_dv_la-aud_aux.o
  1492. libtool: compile:  gcc -DHAVE_CONFIG_H -I. -I.. -D_REENTRANT -DMOD_PATH=\"/usr/lib/transcode\" -I.. -I../src -Wdate-time -D_FORTIFY_SOURCE=2 -Wall -Wstrict-prototypes -Wmissing-prototypes -g -O2 -fdebug-prefix-map=/build/transcode-1.1.7=. -fstack-protector-strong -Wformat -Werror=format-security -c export_dvraw.c  -fPIC -DPIC -o .libs/export_dvraw_la-export_dvraw.o
  1493. /bin/bash ../libtool  --tag=CC   --mode=compile gcc -DHAVE_CONFIG_H -I. -I..  -D_REENTRANT -DMOD_PATH=\"/usr/lib/transcode\" -I.. -I../src -I/usr/include/x86_64-linux-gnu -I/usr/include -Wdate-time -D_FORTIFY_SOURCE=2  -Wall -Wstrict-prototypes -Wmissing-prototypes -g -O2 -fdebug-prefix-map=/build/transcode-1.1.7=. -fstack-protector-strong -Wformat -Werror=format-security -c -o export_ffmpeg_la-export_ffmpeg.lo `test -f 'export_ffmpeg.c' || echo './'`export_ffmpeg.c
  1494. aud_aux.c: In function 'tc_audio_init_ffmpeg':
  1495. aud_aux.c:325:5: warning: 'avcodec_register_all' is deprecated [-Wdeprecated-declarations]
  1496.     TC_INIT_LIBAVCODEC;
  1497.     ^~~~~~~~~~~~~~~~~~
  1498. In file included from ../libtc/tcavcodec.h:33,
  1499.                 from aud_aux.c:48:
  1500. /usr/include/x86_64-linux-gnu/libavcodec/avcodec.h:4102:6: note: declared here
  1501. void avcodec_register_all(void);
  1502.      ^~~~~~~~~~~~~~~~~~~~
  1503. aud_aux.c: In function 'tc_audio_encode_mp3':
  1504. aud_aux.c:757:23: warning: pointer targets in passing argument 5 of 'lame_encode_buffer' differ in signedness [-Wpointer-sign]
  1505.                 output+output_len,
  1506.                 ~~~~~~^~~~~~~~~~~
  1507. In file included from aud_aux.c:41:
  1508. /usr/include/lame/lame.h:716:11: note: expected 'unsigned char *' but argument is of type 'char *'
  1509. int CDECL lame_encode_buffer (
  1510.           ^~~~~~~~~~~~~~~~~~
  1511. aud_aux.c:764:24: warning: pointer targets in passing argument 4 of 'lame_encode_buffer_interleaved' differ in signedness [-Wpointer-sign]
  1512.                 output + output_len,
  1513.                 ~~~~~~~^~~~~~~~~~~~
  1514. In file included from aud_aux.c:41:
  1515. /usr/include/lame/lame.h:731:11: note: expected 'unsigned char *' but argument is of type 'char *'
  1516. int CDECL lame_encode_buffer_interleaved(
  1517.           ^~~~~~~~~~~~~~~~~~~~~~~~~~~~~~
  1518. aud_aux.c:814:45: warning: pointer targets in passing argument 1 of 'tc_get_mp3_header' differ in signedness [-Wpointer-sign]
  1519.         while((size=tc_get_mp3_header(output+offset, NULL, NULL)) > 0)
  1520.                                       ~~~~~~^~~~~~~
  1521. aud_aux.c:140:12: note: expected 'unsigned char *' but argument is of type 'char *'
  1522. static int tc_get_mp3_header(unsigned char* hbuf, int* chans, int* srate);
  1523.            ^~~~~~~~~~~~~~~~~
  1524. aud_aux.c: In function 'tc_audio_encode_ffmpeg':
  1525. aud_aux.c:870:16: warning: implicit declaration of function 'avcodec_encode_audio'; did you mean 'avcodec_encode_audio2'? [-Wimplicit-function-declaration]
  1526.     out_size = avcodec_encode_audio(&mpa_ctx, (unsigned char *)output,
  1527.                ^~~~~~~~~~~~~~~~~~~~
  1528.                avcodec_encode_audio2
  1529. aud_aux.c: In function 'tc_audio_close':
  1530. aud_aux.c:1038:46: warning: pointer targets in passing argument 2 of 'lame_encode_flush' differ in signedness [-Wpointer-sign]
  1531.             outsize = lame_encode_flush(lgf, output, 0);
  1532.                                              ^~~~~~
  1533. In file included from aud_aux.c:41:
  1534. /usr/include/lame/lame.h:875:11: note: expected 'unsigned char *' but argument is of type 'char *'
  1535. int CDECL lame_encode_flush(
  1536.           ^~~~~~~~~~~~~~~~~
  1537. /bin/bash ../libtool  --tag=CC   --mode=compile gcc -DHAVE_CONFIG_H -I. -I..  -D_REENTRANT -DMOD_PATH=\"/usr/lib/transcode\" -I.. -I../src -I/usr/include/x86_64-linux-gnu -I/usr/include -Wdate-time -D_FORTIFY_SOURCE=2  -Wall -Wstrict-prototypes -Wmissing-prototypes -g -O2 -fdebug-prefix-map=/build/transcode-1.1.7=. -fstack-protector-strong -Wformat -Werror=format-security -c -o export_ffmpeg_la-aud_aux.lo `test -f 'aud_aux.c' || echo './'`aud_aux.c
  1538. libtool: compile:  gcc -DHAVE_CONFIG_H -I. -I.. -D_REENTRANT -DMOD_PATH=\"/usr/lib/transcode\" -I.. -I../src -I/usr/include/x86_64-linux-gnu -I/usr/include -Wdate-time -D_FORTIFY_SOURCE=2 -Wall -Wstrict-prototypes -Wmissing-prototypes -g -O2 -fdebug-prefix-map=/build/transcode-1.1.7=. -fstack-protector-strong -Wformat -Werror=format-security -c export_ffmpeg.c  -fPIC -DPIC -o .libs/export_ffmpeg_la-export_ffmpeg.o
  1539. export_ffmpeg.c: In function 'tc_strchrnul':
  1540. export_ffmpeg.c:177:7: warning: assignment discards 'const' qualifier from pointer target type [-Wdiscarded-qualifiers]
  1541.   tmp = s + strlen(s);
  1542.       ^
  1543. /bin/bash ../libtool  --tag=CC   --mode=compile gcc -DHAVE_CONFIG_H -I. -I..  -D_REENTRANT -DMOD_PATH=\"/usr/lib/transcode\" -I.. -I../src -I/usr/include/x86_64-linux-gnu -I/usr/include -Wdate-time -D_FORTIFY_SOURCE=2  -Wall -Wstrict-prototypes -Wmissing-prototypes -g -O2 -fdebug-prefix-map=/build/transcode-1.1.7=. -fstack-protector-strong -Wformat -Werror=format-security -c -o export_ffmpeg_la-ffmpeg_cfg.lo `test -f 'ffmpeg_cfg.c' || echo './'`ffmpeg_cfg.c
  1544. export_ffmpeg.c: In function 'export_ffmpeg_init':
  1545. export_ffmpeg.c:494:5: warning: 'avcodec_register_all' is deprecated [-Wdeprecated-declarations]
  1546.     avcodec_register_all();
  1547.     ^~~~~~~~~~~~~~~~~~~~
  1548. In file included from ../libtc/tcavcodec.h:33,
  1549.                 from export_ffmpeg.c:28:
  1550. /usr/include/x86_64-linux-gnu/libavcodec/avcodec.h:4102:6: note: declared here
  1551. void avcodec_register_all(void);
  1552.      ^~~~~~~~~~~~~~~~~~~~
  1553. export_ffmpeg.c:510:25: warning: implicit declaration of function 'avcodec_alloc_frame'; did you mean 'avcodec_send_frame'? [-Wimplicit-function-declaration]
  1554.     lavc_venc_frame   = avcodec_alloc_frame();
  1555.                         ^~~~~~~~~~~~~~~~~~~
  1556.                         avcodec_send_frame
  1557. export_ffmpeg.c:510:23: warning: assignment to 'AVFrame *' {aka 'struct AVFrame *'} from 'int' makes pointer from integer without a cast [-Wint-conversion]
  1558.     lavc_venc_frame   = avcodec_alloc_frame();
  1559.                       ^
  1560. export_ffmpeg.c:512:23: warning: assignment to 'AVFrame *' {aka 'struct AVFrame *'} from 'int' makes pointer from integer without a cast [-Wint-conversion]
  1561.     lavc_convert_frame= avcodec_alloc_frame();
  1562.                       ^
  1563. export_ffmpeg.c:513:5: warning: 'avpicture_get_size' is deprecated [-Wdeprecated-declarations]
  1564.     size = avpicture_get_size(PIX_FMT_RGB24, vob->ex_v_width, vob->ex_v_height);
  1565.     ^~~~
  1566. In file included from ../libtc/tcavcodec.h:33,
  1567.                 from export_ffmpeg.c:28:
  1568. /usr/include/x86_64-linux-gnu/libavcodec/avcodec.h:5450:5: note: declared here
  1569. int avpicture_get_size(enum AVPixelFormat pix_fmt, int width, int height);
  1570.     ^~~~~~~~~~~~~~~~~~
  1571. export_ffmpeg.c:513:31: error: 'PIX_FMT_RGB24' undeclared (first use in this function); did you mean 'AV_PIX_FMT_RGB24'?
  1572.     size = avpicture_get_size(PIX_FMT_RGB24, vob->ex_v_width, vob->ex_v_height);
  1573.                               ^~~~~~~~~~~~~
  1574.                               AV_PIX_FMT_RGB24
  1575. export_ffmpeg.c:513:31: note: each undeclared identifier is reported only once for each function it appears in
  1576. export_ffmpeg.c:851:24: error: 'AVCodecContext' {aka 'struct AVCodecContext'} has no member named 'lmin'; did you mean 'qmin'?
  1577.     lavc_venc_context->lmin= (int)(FF_QP2LAMBDA * lavc_param_lmin + 0.5);
  1578.                        ^~~~
  1579.                        qmin
  1580. export_ffmpeg.c:852:24: error: 'AVCodecContext' {aka 'struct AVCodecContext'} has no member named 'lmax'; did you mean 'qmax'?
  1581.     lavc_venc_context->lmax= (int)(FF_QP2LAMBDA * lavc_param_lmax + 0.5);
  1582.                        ^~~~
  1583.                        qmax
  1584. export_ffmpeg.c:858:24: error: 'AVCodecContext' {aka 'struct AVCodecContext'} has no member named 'rc_strategy'; did you mean 'b_frame_strategy'?
  1585.     lavc_venc_context->rc_strategy        = lavc_param_vrc_strategy;
  1586.                        ^~~~~~~~~~~
  1587.                        b_frame_strategy
  1588. export_ffmpeg.c:859:5: warning: 'b_frame_strategy' is deprecated [-Wdeprecated-declarations]
  1589.     lavc_venc_context->b_frame_strategy   = lavc_param_vb_strategy;
  1590.     ^~~~~~~~~~~~~~~~~
  1591. In file included from ../libtc/tcavcodec.h:33,
  1592.                 from export_ffmpeg.c:28:
  1593. /usr/include/x86_64-linux-gnu/libavcodec/avcodec.h:1807:9: note: declared here
  1594.     int b_frame_strategy;
  1595.         ^~~~~~~~~~~~~~~~
  1596. export_ffmpeg.c:868:5: warning: 'rtp_payload_size' is deprecated [-Wdeprecated-declarations]
  1597.     lavc_venc_context->rtp_payload_size   = lavc_param_packet_size;
  1598.     ^~~~~~~~~~~~~~~~~
  1599. In file included from ../libtc/tcavcodec.h:33,
  1600.                 from export_ffmpeg.c:28:
  1601. /usr/include/x86_64-linux-gnu/libavcodec/avcodec.h:2511:9: note: declared here
  1602.     int rtp_payload_size;   /* The size of the RTP payload: the coder will  */
  1603.         ^~~~~~~~~~~~~~~~
  1604. export_ffmpeg.c:876:22: error: 'AVCodecContext' {aka 'struct AVCodecContext'} has no member named 'rc_qsquish'
  1605.     lavc_venc_context->rc_qsquish         = lavc_param_rc_qsquish;
  1606.                      ^~
  1607. export_ffmpeg.c:877:22: error: 'AVCodecContext' {aka 'struct AVCodecContext'} has no member named 'rc_qmod_amp'
  1608.     lavc_venc_context->rc_qmod_amp        = lavc_param_rc_qmod_amp;
  1609.                      ^~
  1610. export_ffmpeg.c:878:22: error: 'AVCodecContext' {aka 'struct AVCodecContext'} has no member named 'rc_qmod_freq'
  1611.     lavc_venc_context->rc_qmod_freq       = lavc_param_rc_qmod_freq;
  1612.                      ^~
  1613. export_ffmpeg.c:879:22: error: 'AVCodecContext' {aka 'struct AVCodecContext'} has no member named 'rc_eq'
  1614.     lavc_venc_context->rc_eq              = lavc_param_rc_eq;
  1615.                      ^~
  1616. export_ffmpeg.c:883:24: error: 'AVCodecContext' {aka 'struct AVCodecContext'} has no member named 'rc_buffer_aggressivity'; did you mean 'rc_buffer_size'?
  1617.     lavc_venc_context->rc_buffer_aggressivity= lavc_param_rc_buffer_aggressivity;
  1618.                        ^~~~~~~~~~~~~~~~~~~~~~
  1619.                        rc_buffer_size
  1620. export_ffmpeg.c:884:22: error: 'AVCodecContext' {aka 'struct AVCodecContext'} has no member named 'rc_initial_cplx'
  1621.     lavc_venc_context->rc_initial_cplx    = lavc_param_rc_initial_cplx;
  1622.                      ^~
  1623. export_ffmpeg.c:887:5: warning: 'pre_me' is deprecated [-Wdeprecated-declarations]
  1624.     lavc_venc_context->pre_me             = lavc_param_pre_me;
  1625.     ^~~~~~~~~~~~~~~~~
  1626. In file included from ../libtc/tcavcodec.h:33,
  1627.                 from export_ffmpeg.c:28:
  1628. /usr/include/x86_64-linux-gnu/libavcodec/avcodec.h:1973:9: note: declared here
  1629.     int pre_me;
  1630.         ^~~~~~
  1631. export_ffmpeg.c:892:24: error: 'AVCodecContext' {aka 'struct AVCodecContext'} has no member named 'intra_quant_bias'; did you mean 'intra_matrix'?
  1632.     lavc_venc_context->intra_quant_bias   = lavc_param_ibias;
  1633.                        ^~~~~~~~~~~~~~~~
  1634.                        intra_matrix
  1635. export_ffmpeg.c:893:24: error: 'AVCodecContext' {aka 'struct AVCodecContext'} has no member named 'inter_quant_bias'; did you mean 'inter_matrix'?
  1636.     lavc_venc_context->inter_quant_bias   = lavc_param_pbias;
  1637.                        ^~~~~~~~~~~~~~~~
  1638.                        inter_matrix
  1639. export_ffmpeg.c:894:5: warning: 'coder_type' is deprecated [-Wdeprecated-declarations]
  1640.     lavc_venc_context->coder_type         = lavc_param_coder;
  1641.     ^~~~~~~~~~~~~~~~~
  1642. In file included from ../libtc/tcavcodec.h:33,
  1643.                 from export_ffmpeg.c:28:
  1644. /usr/include/x86_64-linux-gnu/libavcodec/avcodec.h:2446:9: note: declared here
  1645.     int coder_type;
  1646.         ^~~~~~~~~~
  1647. export_ffmpeg.c:895:5: warning: 'context_model' is deprecated [-Wdeprecated-declarations]
  1648.     lavc_venc_context->context_model      = lavc_param_context;
  1649.     ^~~~~~~~~~~~~~~~~
  1650. In file included from ../libtc/tcavcodec.h:33,
  1651.                 from export_ffmpeg.c:28:
  1652. /usr/include/x86_64-linux-gnu/libavcodec/avcodec.h:2452:9: note: declared here
  1653.     int context_model;
  1654.         ^~~~~~~~~~~~~
  1655. export_ffmpeg.c:896:5: warning: 'scenechange_threshold' is deprecated [-Wdeprecated-declarations]
  1656.     lavc_venc_context->scenechange_threshold= lavc_param_sc_threshold;
  1657.     ^~~~~~~~~~~~~~~~~
  1658. In file included from ../libtc/tcavcodec.h:33,
  1659.                 from export_ffmpeg.c:28:
  1660. /usr/include/x86_64-linux-gnu/libavcodec/avcodec.h:2043:9: note: declared here
  1661.     int scenechange_threshold;
  1662.         ^~~~~~~~~~~~~~~~~~~~~
  1663. export_ffmpeg.c:897:5: warning: 'noise_reduction' is deprecated [-Wdeprecated-declarations]
  1664.     lavc_venc_context->noise_reduction    = lavc_param_noise_reduction;
  1665.     ^~~~~~~~~~~~~~~~~
  1666. In file included from ../libtc/tcavcodec.h:33,
  1667.                 from export_ffmpeg.c:28:
  1668. /usr/include/x86_64-linux-gnu/libavcodec/avcodec.h:2047:9: note: declared here
  1669.     int noise_reduction;
  1670.         ^~~~~~~~~~~~~~~
  1671. export_ffmpeg.c:990:5: warning: 'mpeg_quant' is deprecated [-Wdeprecated-declarations]
  1672.     lavc_venc_context->mpeg_quant            = lavc_param_mpeg_quant;
  1673.     ^~~~~~~~~~~~~~~~~
  1674. In file included from ../libtc/tcavcodec.h:33,
  1675.                 from export_ffmpeg.c:28:
  1676. /usr/include/x86_64-linux-gnu/libavcodec/avcodec.h:1828:9: note: declared here
  1677.     int mpeg_quant;
  1678.         ^~~~~~~~~~
  1679. libtool: compile:  gcc -DHAVE_CONFIG_H -I. -I.. -D_REENTRANT -DMOD_PATH=\"/usr/lib/transcode\" -I.. -I../src -I/usr/include/x86_64-linux-gnu -I/usr/include -Wdate-time -D_FORTIFY_SOURCE=2 -Wall -Wstrict-prototypes -Wmissing-prototypes -g -O2 -fdebug-prefix-map=/build/transcode-1.1.7=. -fstack-protector-strong -Wformat -Werror=format-security -c aud_aux.c  -fPIC -DPIC -o .libs/export_ffmpeg_la-aud_aux.o
  1680. export_ffmpeg.c:1107:37: error: 'CODEC_FLAG_GRAY' undeclared (first use in this function); did you mean 'AV_CODEC_FLAG_GRAY'?
  1681.         lavc_venc_context->flags |= CODEC_FLAG_GRAY;
  1682.                                     ^~~~~~~~~~~~~~~
  1683.                                     AV_CODEC_FLAG_GRAY
  1684. export_ffmpeg.c:1109:37: error: 'CODEC_FLAG_NORMALIZE_AQP' undeclared (first use in this function)
  1685.         lavc_venc_context->flags |= CODEC_FLAG_NORMALIZE_AQP;
  1686.                                     ^~~~~~~~~~~~~~~~~~~~~~~~
  1687. export_ffmpeg.c:1127:9: error: 'CODEC_FLAG_INTERLACED_DCT' undeclared (first use in this function); did you mean 'AV_CODEC_FLAG_INTERLACED_DCT'?
  1688.         CODEC_FLAG_INTERLACED_DCT : 0;
  1689.         ^~~~~~~~~~~~~~~~~~~~~~~~~
  1690.         AV_CODEC_FLAG_INTERLACED_DCT
  1691. export_ffmpeg.c:1129:9: error: 'CODEC_FLAG_INTERLACED_ME' undeclared (first use in this function); did you mean 'AV_CODEC_FLAG_INTERLACED_ME'?
  1692.         CODEC_FLAG_INTERLACED_ME : 0;
  1693.         ^~~~~~~~~~~~~~~~~~~~~~~~
  1694.         AV_CODEC_FLAG_INTERLACED_ME
  1695. export_ffmpeg.c:1134:5: warning: 'prediction_method' is deprecated [-Wdeprecated-declarations]
  1696.     lavc_venc_context->prediction_method = lavc_param_prediction_method;
  1697.     ^~~~~~~~~~~~~~~~~
  1698. In file included from ../libtc/tcavcodec.h:33,
  1699.                 from export_ffmpeg.c:28:
  1700. /usr/include/x86_64-linux-gnu/libavcodec/avcodec.h:1892:10: note: declared here
  1701.      int prediction_method;
  1702.          ^~~~~~~~~~~~~~~~~
  1703. export_ffmpeg.c:1137:38: error: 'PIX_FMT_YUV422P' undeclared (first use in this function); did you mean 'AV_PIX_FMT_YUV422P'?
  1704.         lavc_venc_context->pix_fmt = PIX_FMT_YUV422P;
  1705.                                      ^~~~~~~~~~~~~~~
  1706.                                      AV_PIX_FMT_YUV422P
  1707. export_ffmpeg.c:1146:50: error: 'PIX_FMT_YUVJ420P' undeclared (first use in this function); did you mean 'AV_PIX_FMT_YUVJ420P'?
  1708.                     lavc_venc_context->pix_fmt = PIX_FMT_YUVJ420P;
  1709.                                                  ^~~~~~~~~~~~~~~~
  1710.                                                  AV_PIX_FMT_YUVJ420P
  1711. export_ffmpeg.c:1148:50: error: 'PIX_FMT_YUV420P' undeclared (first use in this function); did you mean 'AV_PIX_FMT_YUV420P'?
  1712.                     lavc_venc_context->pix_fmt = PIX_FMT_YUV420P;
  1713.                                                  ^~~~~~~~~~~~~~~
  1714.                                                  AV_PIX_FMT_YUV420P
  1715. export_ffmpeg.c:1155:50: error: 'PIX_FMT_YUVJ422P' undeclared (first use in this function); did you mean 'AV_PIX_FMT_YUVJ422P'?
  1716.                     lavc_venc_context->pix_fmt = PIX_FMT_YUVJ422P;
  1717.                                                  ^~~~~~~~~~~~~~~~
  1718.                                                  AV_PIX_FMT_YUVJ422P
  1719. export_ffmpeg.c:1176:37: error: 'CODEC_FLAG_PASS1' undeclared (first use in this function); did you mean 'AV_CODEC_FLAG_PASS1'?
  1720.         lavc_venc_context->flags |= CODEC_FLAG_PASS1;
  1721.                                     ^~~~~~~~~~~~~~~~
  1722.                                     AV_CODEC_FLAG_PASS1
  1723. export_ffmpeg.c:1190:37: error: 'CODEC_FLAG_PASS2' undeclared (first use in this function); did you mean 'AV_CODEC_FLAG_PASS2'?
  1724.         lavc_venc_context->flags |= CODEC_FLAG_PASS2;
  1725.                                     ^~~~~~~~~~~~~~~~
  1726.                                     AV_CODEC_FLAG_PASS2
  1727. export_ffmpeg.c:1221:39: error: 'CODEC_FLAG_QSCALE' undeclared (first use in this function); did you mean 'AV_CODEC_FLAG_QSCALE'?
  1728.         lavc_venc_context->flags   |= CODEC_FLAG_QSCALE;
  1729.                                       ^~~~~~~~~~~~~~~~~
  1730.                                       AV_CODEC_FLAG_QSCALE
  1731. export_ffmpeg.c:1226:22: error: 'AVCodecContext' {aka 'struct AVCodecContext'} has no member named 'me_method'
  1732.     lavc_venc_context->me_method = ME_ZERO + lavc_param_vme;
  1733.                      ^~
  1734. export_ffmpeg.c:1226:36: error: 'ME_ZERO' undeclared (first use in this function); did you mean 'FP_ZERO'?
  1735.     lavc_venc_context->me_method = ME_ZERO + lavc_param_vme;
  1736.                                    ^~~~~~~
  1737.                                    FP_ZERO
  1738. export_ffmpeg.c:1231:20: warning: assignment discards 'const' qualifier from pointer target type [-Wdiscarded-qualifiers]
  1739.   video_codec_name = ffmpeg_codec_name(codec->name);
  1740.                    ^
  1741. In file included from ../libtc/tcframes.h:34,
  1742.                 from ../src/framebuffer.h:32,
  1743.                 from ../src/transcode.h:56,
  1744.                 from export_ffmpeg.c:26:
  1745. export_ffmpeg.c:1315:31: warning: format '%d' expects argument of type 'int', but argument 4 has type 'int64_t' {aka 'long int'} [-Wformat=]
  1746.         tc_log_info(MOD_NAME, "      bitrate [kBits/s]: %d",
  1747.                               ^~~~~~~~~~~~~~~~~~~~~~~~~~~~~
  1748.                 lavc_venc_context->bit_rate/1000);
  1749.                 ~~~~~~~~~~~~~~~~~~~~~~~~~~~~~~~~
  1750. ../libtc/libtc.h:189:30: note: in definition of macro 'tc_log_info'
  1751.     tc_log(TC_LOG_INFO, tag, format , ## args)
  1752.                              ^~~~~~
  1753. export_ffmpeg.c: In function 'export_ffmpeg_encode':
  1754. export_ffmpeg.c:1640:17: warning: 'avpicture_fill' is deprecated [-Wdeprecated-declarations]
  1755.                 avpicture_fill((AVPicture *)lavc_venc_frame, img_buffer,
  1756.                 ^~~~~~~~~~~~~~
  1757. In file included from ../libtc/tcavcodec.h:33,
  1758.                 from export_ffmpeg.c:28:
  1759. /usr/include/x86_64-linux-gnu/libavcodec/avcodec.h:5435:5: note: declared here
  1760. int avpicture_fill(AVPicture *picture, const uint8_t *ptr,
  1761.     ^~~~~~~~~~~~~~
  1762. export_ffmpeg.c:1641:32: error: 'PIX_FMT_YUV422P' undeclared (first use in this function); did you mean 'AV_PIX_FMT_YUV422P'?
  1763.                                PIX_FMT_YUV422P, lavc_venc_context->width,
  1764.                                ^~~~~~~~~~~~~~~
  1765.                                AV_PIX_FMT_YUV422P
  1766. export_ffmpeg.c:1670:17: warning: 'avpicture_fill' is deprecated [-Wdeprecated-declarations]
  1767.                 avpicture_fill((AVPicture *)lavc_venc_frame, img_buffer,
  1768.                 ^~~~~~~~~~~~~~
  1769. In file included from ../libtc/tcavcodec.h:33,
  1770.                 from export_ffmpeg.c:28:
  1771. /usr/include/x86_64-linux-gnu/libavcodec/avcodec.h:5435:5: note: declared here
  1772. int avpicture_fill(AVPicture *picture, const uint8_t *ptr,
  1773.     ^~~~~~~~~~~~~~
  1774. export_ffmpeg.c:1671:32: error: 'PIX_FMT_YUV420P' undeclared (first use in this function); did you mean 'AV_PIX_FMT_YUV420P'?
  1775.                                PIX_FMT_YUV420P, lavc_venc_context->width,
  1776.                                ^~~~~~~~~~~~~~~
  1777.                                AV_PIX_FMT_YUV420P
  1778. export_ffmpeg.c:1681:13: warning: 'avpicture_fill' is deprecated [-Wdeprecated-declarations]
  1779.             avpicture_fill((AVPicture *)lavc_venc_frame, img_buffer,
  1780.             ^~~~~~~~~~~~~~
  1781. In file included from ../libtc/tcavcodec.h:33,
  1782.                 from export_ffmpeg.c:28:
  1783. /usr/include/x86_64-linux-gnu/libavcodec/avcodec.h:5435:5: note: declared here
  1784. int avpicture_fill(AVPicture *picture, const uint8_t *ptr,
  1785.     ^~~~~~~~~~~~~~
  1786. export_ffmpeg.c:1697:16: warning: implicit declaration of function 'avcodec_encode_video'; did you mean 'avcodec_encode_video2'? [-Wimplicit-function-declaration]
  1787.     out_size = avcodec_encode_video(lavc_venc_context,
  1788.                ^~~~~~~~~~~~~~~~~~~~
  1789.                avcodec_encode_video2
  1790. export_ffmpeg.c:1715:7: warning: 'coded_frame' is deprecated [-Wdeprecated-declarations]
  1791.       if (lavc_venc_context->coded_frame->key_frame) tc_outstream_rotate();
  1792.       ^~
  1793. In file included from ../libtc/tcavcodec.h:33,
  1794.                 from export_ffmpeg.c:28:
  1795. /usr/include/x86_64-linux-gnu/libavcodec/avcodec.h:2776:35: note: declared here
  1796.     attribute_deprecated AVFrame *coded_frame;
  1797.                                   ^~~~~~~~~~~
  1798. export_ffmpeg.c:1718:24: warning: 'coded_frame' is deprecated [-Wdeprecated-declarations]
  1799.                        lavc_venc_context->coded_frame->key_frame? 1 : 0) < 0) {
  1800.                        ^~~~~~~~~~~~~~~~~
  1801. In file included from ../libtc/tcavcodec.h:33,
  1802.                 from export_ffmpeg.c:28:
  1803. /usr/include/x86_64-linux-gnu/libavcodec/avcodec.h:2776:35: note: declared here
  1804.     attribute_deprecated AVFrame *coded_frame;
  1805.                                   ^~~~~~~~~~~
  1806. export_ffmpeg.c:1717:36: warning: pointer targets in passing argument 2 of 'AVI_write_frame' differ in signedness [-Wpointer-sign]
  1807.       if (AVI_write_frame(avifile, enc_buffer, out_size,
  1808.                                    ^~~~~~~~~~
  1809. In file included from ../src/transcode.h:44,
  1810.                 from export_ffmpeg.c:26:
  1811. ../avilib/avilib.h:329:6: note: expected 'const char *' but argument is of type 'uint8_t *' {aka 'unsigned char *'}
  1812. int  AVI_write_frame(avi_t *AVI, const char *data, long bytes, int keyframe);
  1813.      ^~~~~~~~~~~~~~~
  1814. export_ffmpeg.c:1753:13: warning: 'coded_frame' is deprecated [-Wdeprecated-declarations]
  1815.             lavc_venc_context->coded_frame->coded_picture_number,
  1816.             ^~~~~~~~~~~~~~~~~
  1817. In file included from ../libtc/tcavcodec.h:33,
  1818.                 from export_ffmpeg.c:28:
  1819. /usr/include/x86_64-linux-gnu/libavcodec/avcodec.h:2776:35: note: declared here
  1820.     attribute_deprecated AVFrame *coded_frame;
  1821.                                   ^~~~~~~~~~~
  1822. export_ffmpeg.c:1754:13: warning: 'coded_frame' is deprecated [-Wdeprecated-declarations]
  1823.             lavc_venc_context->coded_frame->quality,
  1824.             ^~~~~~~~~~~~~~~~~
  1825. In file included from ../libtc/tcavcodec.h:33,
  1826.                 from export_ffmpeg.c:28:
  1827. /usr/include/x86_64-linux-gnu/libavcodec/avcodec.h:2776:35: note: declared here
  1828.     attribute_deprecated AVFrame *coded_frame;
  1829.                                   ^~~~~~~~~~~
  1830. export_ffmpeg.c:1756:13: warning: 'coded_frame' is deprecated [-Wdeprecated-declarations]
  1831.             psnr(lavc_venc_context->coded_frame->error[0]/f),
  1832.             ^~~~
  1833. In file included from ../libtc/tcavcodec.h:33,
  1834.                 from export_ffmpeg.c:28:
  1835. /usr/include/x86_64-linux-gnu/libavcodec/avcodec.h:2776:35: note: declared here
  1836.     attribute_deprecated AVFrame *coded_frame;
  1837.                                   ^~~~~~~~~~~
  1838. export_ffmpeg.c:1756:13: warning: 'error' is deprecated [-Wdeprecated-declarations]
  1839.             psnr(lavc_venc_context->coded_frame->error[0]/f),
  1840.             ^~~~
  1841. In file included from /usr/include/x86_64-linux-gnu/libavcodec/avcodec.h:38,
  1842.                 from ../libtc/tcavcodec.h:33,
  1843.                 from export_ffmpeg.c:28:
  1844. /usr/include/x86_64-linux-gnu/libavutil/frame.h:361:14: note: declared here
  1845.     uint64_t error[AV_NUM_DATA_POINTERS];
  1846.              ^~~~~
  1847. export_ffmpeg.c:1757:13: warning: 'coded_frame' is deprecated [-Wdeprecated-declarations]
  1848.             psnr(lavc_venc_context->coded_frame->error[1]*4/f),
  1849.             ^~~~
  1850. In file included from ../libtc/tcavcodec.h:33,
  1851.                 from export_ffmpeg.c:28:
  1852. /usr/include/x86_64-linux-gnu/libavcodec/avcodec.h:2776:35: note: declared here
  1853.     attribute_deprecated AVFrame *coded_frame;
  1854.                                   ^~~~~~~~~~~
  1855. export_ffmpeg.c:1757:13: warning: 'error' is deprecated [-Wdeprecated-declarations]
  1856.             psnr(lavc_venc_context->coded_frame->error[1]*4/f),
  1857.             ^~~~
  1858. In file included from /usr/include/x86_64-linux-gnu/libavcodec/avcodec.h:38,
  1859.                 from ../libtc/tcavcodec.h:33,
  1860.                 from export_ffmpeg.c:28:
  1861. /usr/include/x86_64-linux-gnu/libavutil/frame.h:361:14: note: declared here
  1862.     uint64_t error[AV_NUM_DATA_POINTERS];
  1863.              ^~~~~
  1864. export_ffmpeg.c:1758:13: warning: 'coded_frame' is deprecated [-Wdeprecated-declarations]
  1865.             psnr(lavc_venc_context->coded_frame->error[2]*4/f),
  1866.             ^~~~
  1867. In file included from ../libtc/tcavcodec.h:33,
  1868.                 from export_ffmpeg.c:28:
  1869. /usr/include/x86_64-linux-gnu/libavcodec/avcodec.h:2776:35: note: declared here
  1870.     attribute_deprecated AVFrame *coded_frame;
  1871.                                   ^~~~~~~~~~~
  1872. export_ffmpeg.c:1758:13: warning: 'error' is deprecated [-Wdeprecated-declarations]
  1873.             psnr(lavc_venc_context->coded_frame->error[2]*4/f),
  1874.             ^~~~
  1875. In file included from /usr/include/x86_64-linux-gnu/libavcodec/avcodec.h:38,
  1876.                 from ../libtc/tcavcodec.h:33,
  1877.                 from export_ffmpeg.c:28:
  1878. /usr/include/x86_64-linux-gnu/libavutil/frame.h:361:14: note: declared here
  1879.     uint64_t error[AV_NUM_DATA_POINTERS];
  1880.              ^~~~~
  1881. export_ffmpeg.c:1759:13: warning: 'coded_frame' is deprecated [-Wdeprecated-declarations]
  1882.             psnr((lavc_venc_context->coded_frame->error[0]+lavc_venc_context->coded_frame->error[1]+lavc_venc_context->coded_frame->error[2])/(f*1.5)),
  1883.             ^~~~
  1884. In file included from ../libtc/tcavcodec.h:33,
  1885.                 from export_ffmpeg.c:28:
  1886. /usr/include/x86_64-linux-gnu/libavcodec/avcodec.h:2776:35: note: declared here
  1887.     attribute_deprecated AVFrame *coded_frame;
  1888.                                   ^~~~~~~~~~~
  1889. export_ffmpeg.c:1759:13: warning: 'error' is deprecated [-Wdeprecated-declarations]
  1890.             psnr((lavc_venc_context->coded_frame->error[0]+lavc_venc_context->coded_frame->error[1]+lavc_venc_context->coded_frame->error[2])/(f*1.5)),
  1891.             ^~~~
  1892. In file included from /usr/include/x86_64-linux-gnu/libavcodec/avcodec.h:38,
  1893.                 from ../libtc/tcavcodec.h:33,
  1894.                 from export_ffmpeg.c:28:
  1895. /usr/include/x86_64-linux-gnu/libavutil/frame.h:361:14: note: declared here
  1896.     uint64_t error[AV_NUM_DATA_POINTERS];
  1897.              ^~~~~
  1898. export_ffmpeg.c:1759:13: warning: 'coded_frame' is deprecated [-Wdeprecated-declarations]
  1899.             psnr((lavc_venc_context->coded_frame->error[0]+lavc_venc_context->coded_frame->error[1]+lavc_venc_context->coded_frame->error[2])/(f*1.5)),
  1900.             ^~~~
  1901. In file included from ../libtc/tcavcodec.h:33,
  1902.                 from export_ffmpeg.c:28:
  1903. /usr/include/x86_64-linux-gnu/libavcodec/avcodec.h:2776:35: note: declared here
  1904.     attribute_deprecated AVFrame *coded_frame;
  1905.                                   ^~~~~~~~~~~
  1906. export_ffmpeg.c:1759:13: warning: 'error' is deprecated [-Wdeprecated-declarations]
  1907.             psnr((lavc_venc_context->coded_frame->error[0]+lavc_venc_context->coded_frame->error[1]+lavc_venc_context->coded_frame->error[2])/(f*1.5)),
  1908.             ^~~~
  1909. In file included from /usr/include/x86_64-linux-gnu/libavcodec/avcodec.h:38,
  1910.                 from ../libtc/tcavcodec.h:33,
  1911.                 from export_ffmpeg.c:28:
  1912. /usr/include/x86_64-linux-gnu/libavutil/frame.h:361:14: note: declared here
  1913.     uint64_t error[AV_NUM_DATA_POINTERS];
  1914.              ^~~~~
  1915. export_ffmpeg.c:1759:13: warning: 'coded_frame' is deprecated [-Wdeprecated-declarations]
  1916.             psnr((lavc_venc_context->coded_frame->error[0]+lavc_venc_context->coded_frame->error[1]+lavc_venc_context->coded_frame->error[2])/(f*1.5)),
  1917.             ^~~~
  1918. In file included from ../libtc/tcavcodec.h:33,
  1919.                 from export_ffmpeg.c:28:
  1920. /usr/include/x86_64-linux-gnu/libavcodec/avcodec.h:2776:35: note: declared here
  1921.     attribute_deprecated AVFrame *coded_frame;
  1922.                                   ^~~~~~~~~~~
  1923. export_ffmpeg.c:1759:13: warning: 'error' is deprecated [-Wdeprecated-declarations]
  1924.             psnr((lavc_venc_context->coded_frame->error[0]+lavc_venc_context->coded_frame->error[1]+lavc_venc_context->coded_frame->error[2])/(f*1.5)),
  1925.             ^~~~
  1926. In file included from /usr/include/x86_64-linux-gnu/libavcodec/avcodec.h:38,
  1927.                 from ../libtc/tcavcodec.h:33,
  1928.                 from export_ffmpeg.c:28:
  1929. /usr/include/x86_64-linux-gnu/libavutil/frame.h:361:14: note: declared here
  1930.     uint64_t error[AV_NUM_DATA_POINTERS];
  1931.              ^~~~~
  1932. export_ffmpeg.c:1760:13: warning: 'coded_frame' is deprecated [-Wdeprecated-declarations]
  1933.             pict_type_char[lavc_venc_context->coded_frame->pict_type]
  1934.             ^~~~~~~~~~~~~~
  1935. In file included from ../libtc/tcavcodec.h:33,
  1936.                 from export_ffmpeg.c:28:
  1937. /usr/include/x86_64-linux-gnu/libavcodec/avcodec.h:2776:35: note: declared here
  1938.     attribute_deprecated AVFrame *coded_frame;
  1939.                                   ^~~~~~~~~~~
  1940. export_ffmpeg.c:1772:33: warning: pointer targets in passing argument 1 of 'tc_audio_encode' differ in signedness [-Wpointer-sign]
  1941.     return tc_audio_encode(param->buffer, param->size, avifile);
  1942.                            ~~~~~^~~~~~~~
  1943. In file included from export_ffmpeg.c:31:
  1944. aud_aux.h:33:5: note: expected 'char *' but argument is of type 'uint8_t *' {aka 'unsigned char *'}
  1945. int tc_audio_encode(char *aud_buffer, int aud_size, avi_t *avifile);
  1946.     ^~~~~~~~~~~~~~~
  1947. export_ffmpeg.c: In function 'export_ffmpeg_stop':
  1948. export_ffmpeg.c:1800:9: warning: 'coded_frame' is deprecated [-Wdeprecated-declarations]
  1949.         f*= lavc_venc_context->coded_frame->coded_picture_number;
  1950.         ^
  1951. In file included from ../libtc/tcavcodec.h:33,
  1952.                 from export_ffmpeg.c:28:
  1953. /usr/include/x86_64-linux-gnu/libavcodec/avcodec.h:2776:35: note: declared here
  1954.     attribute_deprecated AVFrame *coded_frame;
  1955.                                   ^~~~~~~~~~~
  1956. make[3]: *** [Makefile:1098: export_ffmpeg_la-export_ffmpeg.lo] Error 1
  1957. make[3]: *** Waiting for unfinished jobs....
  1958. aud_aux.c: In function 'tc_audio_init_ffmpeg':
  1959. aud_aux.c:325:5: warning: 'avcodec_register_all' is deprecated [-Wdeprecated-declarations]
  1960.     TC_INIT_LIBAVCODEC;
  1961.     ^~~~~~~~~~~~~~~~~~
  1962. libtool: compile:  gcc -DHAVE_CONFIG_H -I. -I.. -D_REENTRANT -DMOD_PATH=\"/usr/lib/transcode\" -I.. -I../src -I/usr/include/x86_64-linux-gnu -I/usr/include -Wdate-time -D_FORTIFY_SOURCE=2 -Wall -Wstrict-prototypes -Wmissing-prototypes -g -O2 -fdebug-prefix-map=/build/transcode-1.1.7=. -fstack-protector-strong -Wformat -Werror=format-security -c ffmpeg_cfg.c  -fPIC -DPIC -o .libs/export_ffmpeg_la-ffmpeg_cfg.o
  1963. In file included from ../libtc/tcavcodec.h:33,
  1964.                 from aud_aux.c:48:
  1965. /usr/include/x86_64-linux-gnu/libavcodec/avcodec.h:4102:6: note: declared here
  1966. void avcodec_register_all(void);
  1967.      ^~~~~~~~~~~~~~~~~~~~
  1968. aud_aux.c: In function 'tc_audio_encode_mp3':
  1969. aud_aux.c:757:23: warning: pointer targets in passing argument 5 of 'lame_encode_buffer' differ in signedness [-Wpointer-sign]
  1970.                 output+output_len,
  1971.                 ~~~~~~^~~~~~~~~~~
  1972. In file included from aud_aux.c:41:
  1973. /usr/include/lame/lame.h:716:11: note: expected 'unsigned char *' but argument is of type 'char *'
  1974. int CDECL lame_encode_buffer (
  1975.           ^~~~~~~~~~~~~~~~~~
  1976. aud_aux.c:764:24: warning: pointer targets in passing argument 4 of 'lame_encode_buffer_interleaved' differ in signedness [-Wpointer-sign]
  1977.                 output + output_len,
  1978.                 ~~~~~~~^~~~~~~~~~~~
  1979. In file included from aud_aux.c:41:
  1980. /usr/include/lame/lame.h:731:11: note: expected 'unsigned char *' but argument is of type 'char *'
  1981. int CDECL lame_encode_buffer_interleaved(
  1982.           ^~~~~~~~~~~~~~~~~~~~~~~~~~~~~~
  1983. aud_aux.c:814:45: warning: pointer targets in passing argument 1 of 'tc_get_mp3_header' differ in signedness [-Wpointer-sign]
  1984.         while((size=tc_get_mp3_header(output+offset, NULL, NULL)) > 0)
  1985.                                       ~~~~~~^~~~~~~
  1986. aud_aux.c:140:12: note: expected 'unsigned char *' but argument is of type 'char *'
  1987. static int tc_get_mp3_header(unsigned char* hbuf, int* chans, int* srate);
  1988.            ^~~~~~~~~~~~~~~~~
  1989. aud_aux.c: In function 'tc_audio_encode_ffmpeg':
  1990. aud_aux.c:870:16: warning: implicit declaration of function 'avcodec_encode_audio'; did you mean 'avcodec_encode_audio2'? [-Wimplicit-function-declaration]
  1991.     out_size = avcodec_encode_audio(&mpa_ctx, (unsigned char *)output,
  1992.                ^~~~~~~~~~~~~~~~~~~~
  1993.                avcodec_encode_audio2
  1994. aud_aux.c: In function 'tc_audio_close':
  1995. aud_aux.c:1038:46: warning: pointer targets in passing argument 2 of 'lame_encode_flush' differ in signedness [-Wpointer-sign]
  1996.             outsize = lame_encode_flush(lgf, output, 0);
  1997.                                              ^~~~~~
  1998. In file included from aud_aux.c:41:
  1999. /usr/include/lame/lame.h:875:11: note: expected 'unsigned char *' but argument is of type 'char *'
  2000. int CDECL lame_encode_flush(
  2001.           ^~~~~~~~~~~~~~~~~
  2002. ffmpeg_cfg.c:98:22: error: 'FF_DEFAULT_QUANT_BIAS' undeclared here (not in a function); did you mean 'FF_API_STAT_BITS'?
  2003. int lavc_param_ibias=FF_DEFAULT_QUANT_BIAS;
  2004.                      ^~~~~~~~~~~~~~~~~~~~~
  2005.                      FF_API_STAT_BITS
  2006. ffmpeg_cfg.c:141:56: error: 'CODEC_FLAG_4MV' undeclared here (not in a function); did you mean 'AV_CODEC_FLAG_4MV'?
  2007.     {"v4mv", &lavc_param_v4mv, TCCONF_TYPE_FLAG, 0, 0, CODEC_FLAG_4MV},
  2008.                                                        ^~~~~~~~~~~~~~
  2009.                                                        AV_CODEC_FLAG_4MV
  2010. ffmpeg_cfg.c:154:89: error: 'FF_MAX_B_FRAMES' undeclared here (not in a function); did you mean 'FF_THREAD_FRAME'?
  2011.     {"vmax_b_frames", &lavc_param_vmax_b_frames, TCCONF_TYPE_INT, TCCONF_FLAG_RANGE, 0, FF_MAX_B_FRAMES},
  2012.                                                                                         ^~~~~~~~~~~~~~~
  2013.                                                                                         FF_THREAD_FRAME
  2014. ffmpeg_cfg.c:165:56: error: 'CODEC_FLAG_GRAY' undeclared here (not in a function); did you mean 'AV_CODEC_FLAG_GRAY'?
  2015.     {"gray", &lavc_param_gray, TCCONF_TYPE_FLAG, 0, 0, CODEC_FLAG_GRAY},
  2016.                                                        ^~~~~~~~~~~~~~~
  2017.                                                        AV_CODEC_FLAG_GRAY
  2018. ffmpeg_cfg.c:191:56: error: 'CODEC_FLAG_PSNR' undeclared here (not in a function); did you mean 'AV_CODEC_FLAG_PSNR'?
  2019.     {"psnr", &lavc_param_psnr, TCCONF_TYPE_FLAG, 0, 0, CODEC_FLAG_PSNR},
  2020.                                                        ^~~~~~~~~~~~~~~
  2021.                                                        AV_CODEC_FLAG_PSNR
  2022. ffmpeg_cfg.c:199:56: error: 'CODEC_FLAG_QPEL' undeclared here (not in a function); did you mean 'AV_CODEC_FLAG_QPEL'?
  2023.     {"qpel", &lavc_param_qpel, TCCONF_TYPE_FLAG, 0, 0, CODEC_FLAG_QPEL},
  2024.                                                        ^~~~~~~~~~~~~~~
  2025.                                                        AV_CODEC_FLAG_QPEL
  2026. ffmpeg_cfg.c:212:54: error: 'CODEC_FLAG_AC_PRED' undeclared here (not in a function); did you mean 'AV_CODEC_FLAG_AC_PRED'?
  2027.     {"aic", &lavc_param_aic, TCCONF_TYPE_FLAG, 0, 0, CODEC_FLAG_AC_PRED},
  2028.                                                      ^~~~~~~~~~~~~~~~~~
  2029.                                                      AV_CODEC_FLAG_AC_PRED
  2030. ffmpeg_cfg.c:222:54: error: 'CODEC_FLAG_MV0' undeclared here (not in a function); did you mean 'AV_CODEC_FLAG_4MV'?
  2031.     {"mv0", &lavc_param_mv0, TCCONF_TYPE_FLAG, 0, 0, CODEC_FLAG_MV0},
  2032.                                                      ^~~~~~~~~~~~~~
  2033.                                                      AV_CODEC_FLAG_4MV
  2034. ffmpeg_cfg.c:229:56: error: 'CODEC_FLAG_INTERLACED_ME' undeclared here (not in a function); did you mean 'AV_CODEC_FLAG_INTERLACED_ME'?
  2035.     {"ilme", &lavc_param_ilme, TCCONF_TYPE_FLAG, 0, 0, CODEC_FLAG_INTERLACED_ME},
  2036.                                                        ^~~~~~~~~~~~~~~~~~~~~~~~
  2037.                                                        AV_CODEC_FLAG_INTERLACED_ME
  2038. ffmpeg_cfg.c:233:54: error: 'CODEC_FLAG_GMC' undeclared here (not in a function); did you mean 'AV_CODEC_FLAG_4MV'?
  2039.     {"gmc", &lavc_param_gmc, TCCONF_TYPE_FLAG, 0, 0, CODEC_FLAG_GMC},
  2040.                                                      ^~~~~~~~~~~~~~
  2041.                                                      AV_CODEC_FLAG_4MV
  2042. ffmpeg_cfg.c:234:58: error: 'CODEC_FLAG_TRUNCATED' undeclared here (not in a function); did you mean 'AV_CODEC_FLAG_TRUNCATED'?
  2043.     {"trunc", &lavc_param_trunc, TCCONF_TYPE_FLAG, 0, 0, CODEC_FLAG_TRUNCATED},
  2044.                                                          ^~~~~~~~~~~~~~~~~~~~
  2045.                                                          AV_CODEC_FLAG_TRUNCATED
  2046. ffmpeg_cfg.c:235:66: error: 'CODEC_FLAG_CLOSED_GOP' undeclared here (not in a function); did you mean 'AV_CODEC_FLAG_CLOSED_GOP'?
  2047.     {"closedgop", &lavc_param_closedgop, TCCONF_TYPE_FLAG, 0, 0, CODEC_FLAG_CLOSED_GOP},
  2048.                                                                  ^~~~~~~~~~~~~~~~~~~~~
  2049.                                                                  AV_CODEC_FLAG_CLOSED_GOP
  2050. make[3]: *** [Makefile:1112: export_ffmpeg_la-ffmpeg_cfg.lo] Error 1
  2051. make[3]: Leaving directory '/build/transcode-1.1.7/export'
  2052. make[2]: *** [Makefile:591: all-recursive] Error 1
  2053. make[2]: Leaving directory '/build/transcode-1.1.7'
  2054. make[1]: *** [Makefile:500: all] Error 2
  2055. make[1]: Leaving directory '/build/transcode-1.1.7'
  2056. dh_auto_build: make -j4 returned exit code 2
  2057. make: *** [debian/rules:57: build] Error 2
  2058. dpkg-buildpackage: error: debian/rules build subprocess returned exit status 2
  2059. I: copying local configuration
  2060. E: Failed autobuilding of package
  2061. I: user script /var/cache/pbuilder/build/10882/tmp/hooks/C10shell starting
  2062. Reading package lists...
  2063. Building dependency tree...
  2064. Reading state information...
  2065. The following additional packages will be installed:
  2066.  libgpm2 libssh2-1 mc-data vim-common vim-runtime xxd
  2067. Suggested packages:
  2068.  gpm arj catdvi | texlive-binaries dbview djvulibre-bin epub-utils
  2069.  genisoimage gv imagemagick libaspell-dev links | w3m | lynx odt2txt
  2070.  poppler-utils python python-boto python-tz xpdf | pdf-viewer zip ctags
  2071.  vim-doc vim-scripts
  2072. Recommended packages:
  2073.  unzip
  2074. The following NEW packages will be installed:
  2075.  less libgpm2 libssh2-1 mc mc-data vim vim-common vim-runtime xxd
  2076. 0 upgraded, 9 newly installed, 0 to remove and 0 not upgraded.
  2077. Need to get 9327 kB/9500 kB of archives.
  2078. After this operation, 41.9 MB of additional disk space will be used.
  2079. Get:1 http://ftp.nl.debian.org/debian sid/main amd64 less amd64 487-0.1+b1 [129 kB]
  2080. Get:2 http://ftp.nl.debian.org/debian sid/main amd64 xxd amd64 2:8.1.0875-2 [139 kB]
  2081. Get:3 http://ftp.nl.debian.org/debian sid/main amd64 vim-common all 2:8.1.0875-2 [194 kB]
  2082. Get:4 http://ftp.nl.debian.org/debian sid/main amd64 mc-data all 3:4.8.22-1 [1292 kB]
  2083. Get:5 http://ftp.nl.debian.org/debian sid/main amd64 mc amd64 3:4.8.22-1 [516 kB]
  2084. Get:6 http://ftp.nl.debian.org/debian sid/main amd64 vim-runtime all 2:8.1.0875-2 [5776 kB]
  2085. Get:7 http://ftp.nl.debian.org/debian sid/main amd64 vim amd64 2:8.1.0875-2 [1280 kB]
  2086. debconf: delaying package configuration, since apt-utils is not installed
  2087. Fetched 9327 kB in 5s (1859 kB/s)
  2088. Selecting previously unselected package less.
  2089. (Reading database ...
  2090. (Reading database ... 5%
  2091. (Reading database ... 10%
  2092. (Reading database ... 15%
  2093. (Reading database ... 20%
  2094. (Reading database ... 25%
  2095. (Reading database ... 30%
  2096. (Reading database ... 35%
  2097. (Reading database ... 40%
  2098. (Reading database ... 45%
  2099. (Reading database ... 50%
  2100. (Reading database ... 55%
  2101. (Reading database ... 60%
  2102. (Reading database ... 65%
  2103. (Reading database ... 70%
  2104. (Reading database ... 75%
  2105. (Reading database ... 80%
  2106. (Reading database ... 85%
  2107. (Reading database ... 90%
  2108. (Reading database ... 95%
  2109. (Reading database ... 100%
  2110. (Reading database ... 28777 files and directories currently installed.)
  2111. Preparing to unpack .../0-less_487-0.1+b1_amd64.deb ...
  2112. Unpacking less (487-0.1+b1) ...
  2113. Selecting previously unselected package xxd.
  2114. Preparing to unpack .../1-xxd_2%3a8.1.0875-2_amd64.deb ...
  2115. Unpacking xxd (2:8.1.0875-2) ...
  2116. Selecting previously unselected package vim-common.
  2117. Preparing to unpack .../2-vim-common_2%3a8.1.0875-2_all.deb ...
  2118. Unpacking vim-common (2:8.1.0875-2) ...
  2119. Selecting previously unselected package libgpm2:amd64.
  2120. Preparing to unpack .../3-libgpm2_1.20.7-5_amd64.deb ...
  2121. Unpacking libgpm2:amd64 (1.20.7-5) ...
  2122. Selecting previously unselected package libssh2-1:amd64.
  2123. Preparing to unpack .../4-libssh2-1_1.8.0-2_amd64.deb ...
  2124. Unpacking libssh2-1:amd64 (1.8.0-2) ...
  2125. Selecting previously unselected package mc-data.
  2126. Preparing to unpack .../5-mc-data_3%3a4.8.22-1_all.deb ...
  2127. Unpacking mc-data (3:4.8.22-1) ...
  2128. Selecting previously unselected package mc.
  2129. Preparing to unpack .../6-mc_3%3a4.8.22-1_amd64.deb ...
  2130. Unpacking mc (3:4.8.22-1) ...
  2131. Selecting previously unselected package vim-runtime.
  2132. Preparing to unpack .../7-vim-runtime_2%3a8.1.0875-2_all.deb ...
  2133. Adding 'diversion of /usr/share/vim/vim81/doc/help.txt to /usr/share/vim/vim81/doc/help.txt.vim-tiny by vim-runtime'
  2134. Adding 'diversion of /usr/share/vim/vim81/doc/tags to /usr/share/vim/vim81/doc/tags.vim-tiny by vim-runtime'
  2135. Unpacking vim-runtime (2:8.1.0875-2) ...
  2136. Selecting previously unselected package vim.
  2137. Preparing to unpack .../8-vim_2%3a8.1.0875-2_amd64.deb ...
  2138. Unpacking vim (2:8.1.0875-2) ...
  2139. Setting up libgpm2:amd64 (1.20.7-5) ...
  2140. Setting up less (487-0.1+b1) ...
  2141. Setting up xxd (2:8.1.0875-2) ...
  2142. Setting up vim-common (2:8.1.0875-2) ...
  2143. Setting up mc-data (3:4.8.22-1) ...
  2144. Setting up libssh2-1:amd64 (1.8.0-2) ...
  2145. Setting up vim-runtime (2:8.1.0875-2) ...
  2146. Setting up vim (2:8.1.0875-2) ...
  2147. update-alternatives: using /usr/bin/vim.basic to provide /usr/bin/vim (vim) in auto mode
  2148. update-alternatives: using /usr/bin/vim.basic to provide /usr/bin/vimdiff (vimdiff) in auto mode
  2149. update-alternatives: using /usr/bin/vim.basic to provide /usr/bin/rvim (rvim) in auto mode
  2150. update-alternatives: using /usr/bin/vim.basic to provide /usr/bin/rview (rview) in auto mode
  2151. update-alternatives: using /usr/bin/vim.basic to provide /usr/bin/vi (vi) in auto mode
  2152. update-alternatives: using /usr/bin/vim.basic to provide /usr/bin/view (view) in auto mode
  2153. update-alternatives: using /usr/bin/vim.basic to provide /usr/bin/ex (ex) in auto mode
  2154. Setting up mc (3:4.8.22-1) ...
  2155. Processing triggers for man-db (2.8.5-2) ...
  2156. Processing triggers for mime-support (3.62) ...
  2157. Processing triggers for libc-bin (2.28-8) ...
  2158. I: user script /var/cache/pbuilder/build/10882/tmp/hooks/C10shell finished
  2159. I: unmounting /var/packages filesystem
  2160. I: unmounting dev/ptmx filesystem
  2161. I: unmounting dev/pts filesystem
  2162. I: unmounting dev/shm filesystem
  2163. I: unmounting proc filesystem
  2164. I: unmounting sys filesystem
  2165. I: cleaning the build env 
  2166. I: removing directory /var/cache/pbuilder/build/10882 and its subdirectories
  2167.  

Quellcode

Hier kannst du den Code kopieren und ihn in deinen bevorzugten Editor einfügen. Alternativ kannst du den gesamten Eintrag auch als Datei herunterladen.