NoPaste

build dkms modul

von McAldo
Beschreibung:
Fehler beim erzeugen des evdi DKMS Modules für Kernel 5.2.0-0.bp
Snippet erstellt:
25.11.2019 12:56:40
Snippet wird automatisch gelöscht:
Niemals

Dein Code:
  1. ~/ $ make -j8 KERNELRELEASE=5.2.0-0.bpo.3-amd64 -C /lib/modules/5.2.0-0.bpo.3-amd64/build M=/var/lib/dkms/evdi/1.6.0+dfsg/build DKMS_BUILD=1
  2. make: Entering directory '/usr/src/linux-headers-5.2.0-0.bpo.3-amd64'
  3.   CC [M]  /var/lib/dkms/evdi/1.6.0+dfsg/build/evdi_drv.o
  4.   CC [M]  /var/lib/dkms/evdi/1.6.0+dfsg/build/evdi_connector.o
  5.   CC [M]  /var/lib/dkms/evdi/1.6.0+dfsg/build/evdi_main.o
  6.   CC [M]  /var/lib/dkms/evdi/1.6.0+dfsg/build/evdi_fb.o
  7.   CC [M]  /var/lib/dkms/evdi/1.6.0+dfsg/build/evdi_painter.o
  8.   CC [M]  /var/lib/dkms/evdi/1.6.0+dfsg/build/evdi_params.o
  9.   CC [M]  /var/lib/dkms/evdi/1.6.0+dfsg/build/evdi_cursor.o
  10.   CC [M]  /var/lib/dkms/evdi/1.6.0+dfsg/build/evdi_debug.o
  11.   CC [M]  /var/lib/dkms/evdi/1.6.0+dfsg/build/evdi_ioc32.o
  12. /var/lib/dkms/evdi/1.6.0+dfsg/build/evdi_drv.c:45:11: error: initialization of ‘vm_fault_t (*)(struct vm_fault *)’ {aka ‘unsigned int (*)(struct vm_fault *)’} from incompatible pointer type ‘int (*)(struct vm_fault *)’ [-Werror=incompatible-pointer-types]
  13.   .fault = evdi_gem_fault,
  14.            ^~~~~~~~~~~~~~
  15. /var/lib/dkms/evdi/1.6.0+dfsg/build/evdi_drv.c:45:11: note: (near initialization for ‘evdi_gem_vm_ops.fault’)
  16. /var/lib/dkms/evdi/1.6.0+dfsg/build/evdi_fb.c: In function ‘evdifb_create’:
  17. /var/lib/dkms/evdi/1.6.0+dfsg/build/evdi_fb.c:445:2: error: implicit declaration of function ‘drm_fb_helper_fill_fix’; did you mean ‘drm_fb_helper_fill_info’? [-Werror=implicit-function-declaration]
  18.   drm_fb_helper_fill_fix(info, fb->pitches[0], fb->format->depth);
  19.   ^~~~~~~~~~~~~~~~~~~~~~
  20.   drm_fb_helper_fill_info
  21. /var/lib/dkms/evdi/1.6.0+dfsg/build/evdi_fb.c:447:2: error: implicit declaration of function ‘drm_fb_helper_fill_var’; did you mean ‘drm_fb_helper_fill_info’? [-Werror=implicit-function-declaration]
  22.   drm_fb_helper_fill_var(info, &efbdev->helper, sizes->fb_width,
  23.   ^~~~~~~~~~~~~~~~~~~~~~
  24.   drm_fb_helper_fill_info
  25. /var/lib/dkms/evdi/1.6.0+dfsg/build/evdi_connector.c:124:16: error: ‘drm_helper_probe_single_connector_modes’ undeclared here (not in a function); did you mean ‘drm_helper_move_panel_connectors_to_head’?
  26.   .fill_modes = drm_helper_probe_single_connector_modes,
  27.                 ^~~~~~~~~~~~~~~~~~~~~~~~~~~~~~~~~~~~~~~
  28.                 drm_helper_move_panel_connectors_to_head
  29. make[3]: *** [/usr/src/linux-headers-5.2.0-0.bpo.3-common/scripts/Makefile.build:283: /var/lib/dkms/evdi/1.6.0+dfsg/build/evdi_connector.o] Error 1
  30. make[3]: *** Waiting for unfinished jobs....
  31. /var/lib/dkms/evdi/1.6.0+dfsg/build/evdi_main.c: In function ‘evdi_driver_setup’:
  32. /var/lib/dkms/evdi/1.6.0+dfsg/build/evdi_main.c:54:2: error: implicit declaration of function ‘drm_kms_helper_poll_init’; did you mean ‘drm_modeset_lock_init’? [-Werror=implicit-function-declaration]
  33.   drm_kms_helper_poll_init(dev);
  34.   ^~~~~~~~~~~~~~~~~~~~~~~~
  35.   drm_modeset_lock_init
  36. /var/lib/dkms/evdi/1.6.0+dfsg/build/evdi_painter.c: In function ‘evdi_painter_connect’:
  37. /var/lib/dkms/evdi/1.6.0+dfsg/build/evdi_painter.c:675:2: error: implicit declaration of function ‘drm_helper_hpd_irq_event’; did you mean ‘drm_helper_crtc_in_use’? [-Werror=implicit-function-declaration]
  38.   drm_helper_hpd_irq_event(evdi->ddev);
  39.   ^~~~~~~~~~~~~~~~~~~~~~~~
  40.   drm_helper_crtc_in_use
  41. /var/lib/dkms/evdi/1.6.0+dfsg/build/evdi_main.c: In function ‘evdi_driver_unload’:
  42. /var/lib/dkms/evdi/1.6.0+dfsg/build/evdi_main.c:95:2: error: implicit declaration of function ‘drm_kms_helper_poll_fini’; did you mean ‘drm_modeset_lock_fini’? [-Werror=implicit-function-declaration]
  43.   drm_kms_helper_poll_fini(dev);
  44.   ^~~~~~~~~~~~~~~~~~~~~~~~
  45.   drm_modeset_lock_fini
  46. cc1: some warnings being treated as errors
  47. make[3]: *** [/usr/src/linux-headers-5.2.0-0.bpo.3-common/scripts/Makefile.build:283: /var/lib/dkms/evdi/1.6.0+dfsg/build/evdi_drv.o] Error 1
  48. cc1: some warnings being treated as errors
  49. make[3]: *** [/usr/src/linux-headers-5.2.0-0.bpo.3-common/scripts/Makefile.build:283: /var/lib/dkms/evdi/1.6.0+dfsg/build/evdi_main.o] Error 1
  50. cc1: some warnings being treated as errors
  51. make[3]: *** [/usr/src/linux-headers-5.2.0-0.bpo.3-common/scripts/Makefile.build:283: /var/lib/dkms/evdi/1.6.0+dfsg/build/evdi_fb.o] Error 1
  52. cc1: some warnings being treated as errors
  53. make[3]: *** [/usr/src/linux-headers-5.2.0-0.bpo.3-common/scripts/Makefile.build:283: /var/lib/dkms/evdi/1.6.0+dfsg/build/evdi_painter.o] Error 1
  54. make[2]: *** [/usr/src/linux-headers-5.2.0-0.bpo.3-common/Makefile:1610: _module_/var/lib/dkms/evdi/1.6.0+dfsg/build] Error 2
  55. make[1]: *** [Makefile:179: sub-make] Error 2
  56. make: *** [Makefile:8: all] Error 2
  57. make: Leaving directory '/usr/src/linux-headers-5.2.0-0.bpo.3-amd64'

Quellcode

Hier kannst du den Code kopieren und ihn in deinen bevorzugten Editor einfügen. Alternativ kannst du den gesamten Eintrag auch als Datei herunterladen.